program: Orca
programVersion: 5.0.2
elementType: O O O O N C C C C C C C C C C C C C C C C C C C H H H H H H H H H H H H H H H H H H H H H H H H H
charge: 0
multiplicity: 1
keywords: wb97x-d3
keywords: def2-TZVPP
keywords: def2/J RIJCOSX
keywords: DEFGRID2
keywords: scfconv7
keywords: smallprint printgap noloewdin
keywords: NOSOSCF
formula: C19H25NO4
InChI: InChI=1/C19H25NO4/c1-11(2)9-14-15(19(14,3)4)18(23)24-10-20-16(21)12-7-5-6-8-13(12)17(20)22/h9,14-15H,5-8,10H2,1-4H3
49 atoms
O  0.490889 -1.015846 0.167128
O  1.67292 -0.273302 -1.584653
O  -1.689391 0.741553 -1.3212
O  -2.444207 -3.140523 0.911129
N  -1.737435 -1.349259 -0.360096
C  2.506997 1.998739 0.39435
C  3.588195 0.972823 0.534698
C  2.121853 0.547253 0.629124
C  2.266016 2.912113 1.572689
C  2.247493 2.675459 -0.928668
C  4.469601 0.571029 -0.57721
C  1.44427 -0.256824 -0.400676
C  5.793266 0.386346 -0.507002
C  -0.401963 -1.745841 -0.662969
C  6.566667 -0.011352 -1.72948
C  6.631938 0.551034 0.722741
C  -3.631262 -0.063263 -0.114183
C  -3.850995 -1.205337 0.538316
C  -4.598737 1.053966 -0.232329
C  -5.112696 -1.560684 1.231984
C  -5.748604 0.844996 0.754934
C  -6.221407 -0.607156 0.783617
C  -2.265671 -0.108921 -0.692447
C  -2.636481 -2.053287 0.431361
H  4.060252 0.962552 1.510861
H  1.783882 0.326933 1.6348
H  2.447626 2.411046 2.52451
H  2.925163 3.781515 1.524566
H  1.236613 3.276659 1.579972
H  2.83624 3.593352 -0.982868
H  2.503629 2.076882 -1.797811
H  1.19619 2.956356 -1.017463
H  4.007131 0.422247 -1.544597
H  -0.292393 -2.806383 -0.444512
H  -0.193282 -1.57913 -1.717614
H  7.10574 -0.948458 -1.565816
H  5.924008 -0.142053 -2.600184
H  7.322612 0.738234 -1.979614
H  6.068397 0.81022 1.616776
H  7.18623 -0.36645 0.935821
H  7.381798 1.332023 0.570684
H  -4.099265 2.009164 -0.053465
H  -4.971932 1.099046 -1.26048
H  -5.381692 -2.598899 1.024186
H  -4.962399 -1.499497 2.314545
H  -5.421068 1.137471 1.756471
H  -6.577705 1.503875 0.493265
H  -6.562008 -0.897354 -0.214418
H  -7.080944 -0.708182 1.447628
elementType: O N C H
totalener: -1094.87677806 hartree
nucrepener: 2065.47213251 hartree
electener: -3160.34891057 hartree
oneelecener: -5593.51388894 hartree
twoeener: 2433.16497837 hartree
cpcmener: -0.03080605 hartree
kineticenergy: 1090.04456168 hartree
xcener: -105.973626310244 hartree
chargesum: -0.0000000
charge: -0.288269 -0.456849 -0.412975 -0.409900 -0.096126 0.106868 0.031659 -0.102626 -0.262426 -0.282409 -0.289390 0.406464 -0.059102 0.079273 -0.218576 -0.253764 -0.059342 -0.080537 -0.070532 -0.075407 -0.135165 -0.134127 0.313288 0.324220 0.115662 0.096537 0.086486 0.094679 0.093976 0.097906 0.096153 0.100854 0.123843 0.123758 0.140133 0.091569 0.088459 0.092281 0.087516 0.094916 0.096444 0.093669 0.100324 0.093069 0.101200 0.077712 0.080443 0.077658 0.080503
qa: -0.2883 -0.4568 -0.4130 -0.4099 -0.0961 0.1069 0.0317 -0.1026 -0.2624 -0.2824 -0.2894 0.4065 -0.0591 0.0793 -0.2186 -0.2538 -0.0593 -0.0805 -0.0705 -0.0754 -0.1352 -0.1341 0.3133 0.3242 0.1157 0.0965 0.0865 0.0947 0.0940 0.0979 0.0962 0.1009 0.1238 0.1238 0.1401 0.0916 0.0885 0.0923 0.0875 0.0949 0.0964 0.0937 0.1003 0.0931 0.1012 0.0777 0.0804 0.0777 0.0805
va: 2.1055 2.0410 2.1018 2.1091 3.0925 3.7107 3.7437 3.8528 3.9116 3.9082 3.8512 4.1003 3.7862 3.8655 3.9221 3.9384 3.6628 3.6940 3.9206 3.9203 3.9157 3.9131 4.2220 4.2231 1.0028 1.0298 1.0055 1.0016 1.0022 1.0013 1.0130 1.0019 1.0238 1.0140 1.0164 0.9967 1.0091 0.9962 1.0143 0.9972 0.9966 1.0154 1.0052 1.0159 1.0049 1.0066 1.0095 1.0070 1.0097
dispcorr: -0.022330066 hartree
energy: -1094.899108122567
dipole: 17.20743 -18.56123 -1.35380 15.92770 -15.19699 0.73071 4.16774 -2.90143 1.26631
magnitude: 1.99255 au
magnitude: 5.06466 debye
