program: Orca
programVersion: 5.0.2
elementType: O O O O N C C C C C C C C C C C C C C C C C C C H H H H H H H H H H H H H H H H H H H H H H H H H
charge: 0
multiplicity: 1
keywords: wb97x-d3
keywords: def2-TZVPP
keywords: def2/J RIJCOSX
keywords: DEFGRID2
keywords: scfconv7
keywords: smallprint printgap noloewdin
keywords: NOSOSCF
formula: C19H25NO4
InChI: InChI=1/C19H25NO4/c1-11(2)9-14-15(19(14,3)4)18(23)24-10-20-16(21)12-7-5-6-8-13(12)17(20)22/h9,14-15H,5-8,10H2,1-4H3
49 atoms
O  1.136016 -0.727432 -0.768502
O  2.619012 -1.652289 -2.141971
O  -1.013525 -2.619058 0.842432
O  -1.774631 0.875113 -1.95698
N  -1.129926 -1.021357 -0.814005
C  3.419927 -0.248237 1.186944
C  3.332464 0.982807 0.352105
C  3.431841 -0.381911 -0.328181
C  4.743682 -0.5485 1.851343
C  2.240365 -0.694534 2.017112
C  2.121002 1.842746 0.32992
C  2.377489 -0.981395 -1.16268
C  1.68488 2.545353 -0.718033
C  0.073345 -1.331944 -1.501044
C  0.502668 3.458415 -0.604922
C  2.317519 2.488222 -2.073428
C  -2.763707 -0.945485 0.80664
C  -2.973387 0.093682 -0.003237
C  -3.607415 -1.305463 1.971695
C  -4.069101 1.082119 0.142991
C  -4.924716 -0.530282 1.905255
C  -4.709022 0.934084 1.525094
C  -1.55404 -1.666733 0.342878
C  -1.927609 0.090904 -1.05625
H  4.264265 1.5357 0.255751
H  4.406847 -0.599597 -0.748842
H  4.812293 -0.038742 2.814855
H  4.858985 -1.618863 2.033953
H  5.589165 -0.221849 1.244147
H  2.330912 -0.274004 3.021101
H  1.275656 -0.384296 1.626526
H  2.226081 -1.781186 2.120579
H  1.589864 1.94618 1.272339
H  0.200305 -2.413612 -1.547339
H  0.022959 -0.935379 -2.514809
H  0.070362 3.451194 0.395753
H  0.780881 4.488993 -0.843571
H  -0.281247 3.180263 -1.313741
H  2.702565 3.4698 -2.363318
H  3.141256 1.779155 -2.137383
H  1.578026 2.213666 -2.830555
H  -3.788345 -2.38289 1.99021
H  -3.066328 -1.076704 2.89574
H  -3.687045 2.095437 -0.003376
H  -4.808998 0.922812 -0.648156
H  -5.582764 -1.002505 1.169948
H  -5.435109 -0.595514 2.867412
H  -4.066156 1.409918 2.271296
H  -5.659436 1.469317 1.546015
elementType: O N C H
totalener: -1094.87492449 hartree
nucrepener: 2191.12619422 hartree
electener: -3286.00111872 hartree
oneelecener: -5844.26466322 hartree
twoeener: 2558.26354450 hartree
cpcmener: -0.03062277 hartree
kineticenergy: 1090.04449829 hartree
xcener: -105.971661802994 hartree
chargesum: 0.0000000
charge: -0.251923 -0.472425 -0.408827 -0.413569 -0.093284 0.149070 -0.015641 -0.139536 -0.268180 -0.297027 -0.248906 0.404567 -0.038662 0.065936 -0.233342 -0.259701 -0.049083 -0.050823 -0.073755 -0.070859 -0.136052 -0.137193 0.291581 0.297547 0.112871 0.095775 0.093116 0.095745 0.086515 0.099937 0.083297 0.105216 0.120774 0.135956 0.134082 0.090051 0.103767 0.087289 0.107997 0.091467 0.095863 0.094595 0.101328 0.093483 0.101145 0.078538 0.081111 0.078710 0.081460
qa: -0.2519 -0.4724 -0.4088 -0.4136 -0.0933 0.1491 -0.0156 -0.1395 -0.2682 -0.2970 -0.2489 0.4046 -0.0387 0.0659 -0.2333 -0.2597 -0.0491 -0.0508 -0.0738 -0.0709 -0.1361 -0.1372 0.2916 0.2975 0.1129 0.0958 0.0931 0.0957 0.0865 0.0999 0.0833 0.1052 0.1208 0.1360 0.1341 0.0901 0.1038 0.0873 0.1080 0.0915 0.0959 0.0946 0.1013 0.0935 0.1011 0.0785 0.0811 0.0787 0.0815
va: 2.1009 2.0323 2.1012 2.0919 3.1315 3.6949 3.8021 3.8646 3.9070 3.9171 3.8364 4.1075 3.7080 3.8974 3.9200 3.9418 3.6818 3.6915 3.9177 3.9168 3.9157 3.9147 4.1907 4.1848 1.0053 1.0279 1.0020 1.0016 1.0055 1.0000 1.0036 1.0022 1.0006 1.0020 1.0046 1.0063 0.9976 1.0050 0.9990 1.0072 1.0012 1.0147 1.0053 1.0148 1.0051 1.0066 1.0096 1.0066 1.0093
dispcorr: -0.026634584 hartree
energy: -1094.901559076311
dipole: 3.28697 -4.95308 -1.66612 14.15303 -13.01597 1.13706 11.96431 -10.27476 1.68955
magnitude: 2.63124 au
magnitude: 6.68809 debye
