program: Orca
programVersion: 5.0.2
elementType: O O O O N C C C C C C C C C C C C C C C C C C C H H H H H H H H H H H H H H H H H H H H H H H H H
charge: 0
multiplicity: 1
keywords: wb97x-d3
keywords: def2-TZVPP
keywords: def2/J RIJCOSX
keywords: DEFGRID2
keywords: scfconv7
keywords: smallprint printgap noloewdin
keywords: NOSOSCF
formula: C19H25NO4
InChI: InChI=1/C19H25NO4/c1-11(2)9-14-15(19(14,3)4)18(23)24-10-20-16(21)12-7-5-6-8-13(12)17(20)22/h9,14-15H,5-8,10H2,1-4H3
49 atoms
O  0.969551 -1.847704 0.13746
O  2.137861 -0.809177 1.750121
O  -1.117552 0.40616 1.979549
O  -1.998272 -2.865329 -1.060959
N  -1.273128 -1.460223 0.622627
C  4.252647 -0.15097 -0.403268
C  3.139387 0.77967 -0.752051
C  2.859875 -0.715159 -0.538577
C  5.193459 -0.531085 -1.524783
C  4.951064 -0.05711 0.931844
C  2.618599 1.801037 0.187019
C  2.000178 -1.103353 0.597467
C  1.426555 2.387887 0.074858
C  -0.094392 -2.163976 1.014149
C  0.977599 3.439315 1.041313
C  0.449618 2.050686 -1.013187
C  -2.816644 0.211707 0.27043
C  -3.074524 -0.743764 -0.621727
C  -3.590235 1.469282 0.421797
C  -4.162821 -0.700057 -1.629798
C  -4.90877 1.355261 -0.34603
C  -4.713908 0.724312 -1.725304
C  -1.644054 -0.199765 1.089232
C  -2.089607 -1.843751 -0.43968
H  3.08492 1.063361 -1.799704
H  2.661771 -1.278006 -1.443671
H  4.683581 -0.586822 -2.487768
H  5.99544 0.203268 -1.618971
H  5.652184 -1.503326 -1.336972
H  4.299091 0.23152 1.749488
H  5.394816 -1.01871 1.194179
H  5.761894 0.67103 0.864739
H  3.262789 2.097733 1.006997
H  0.146948 -1.910181 2.045046
H  -0.28042 -3.232363 0.92509
H  0.698218 4.360668 0.523452
H  0.096739 3.099983 1.591175
H  1.751855 3.683451 1.767078
H  0.628468 1.071043 -1.454717
H  -0.572825 2.060969 -0.630274
H  0.486067 2.79081 -1.817587
H  -3.76527 1.683003 1.478485
H  -2.994718 2.308537 0.046097
H  -3.796245 -1.047326 -2.598359
H  -4.951174 -1.403628 -1.343196
H  -5.609374 0.746983 0.233319
H  -5.36459 2.341453 -0.445271
H  -4.021485 1.338402 -2.308435
H  -5.658067 0.7196 -2.271884
totalener: -1094.84930263 hartree
nucrepener: 2185.94718515 hartree
electener: -3280.79648779 hartree
oneelecener: -5833.93660539 hartree
twoeener: 2553.14011760 hartree
kineticenergy: 1090.09541877 hartree
xcener: -105.971195786065 hartree
chargesum: 0.0000000
charge: -0.266955 -0.354991 -0.302275 -0.317205 -0.095214 0.147211 -0.058305 -0.118275 -0.244014 -0.278146 -0.185094 0.334526 0.018184 0.069803 -0.208254 -0.270970 -0.097736 -0.069181 -0.062152 -0.073565 -0.134660 -0.134273 0.203187 0.259192 0.092765 0.087478 0.070116 0.088336 0.091213 0.103080 0.086224 0.087736 0.086207 0.136539 0.116474 0.082453 0.092213 0.076325 0.090966 0.053438 0.112601 0.097764 0.089161 0.093975 0.091819 0.076693 0.080217 0.074884 0.080487
qa: -0.2670 -0.3550 -0.3023 -0.3172 -0.0952 0.1472 -0.0583 -0.1183 -0.2440 -0.2781 -0.1851 0.3345 0.0182 0.0698 -0.2083 -0.2710 -0.0977 -0.0692 -0.0622 -0.0736 -0.1347 -0.1343 0.2032 0.2592 0.0928 0.0875 0.0701 0.0883 0.0912 0.1031 0.0862 0.0877 0.0862 0.1365 0.1165 0.0825 0.0922 0.0763 0.0910 0.0534 0.1126 0.0978 0.0892 0.0940 0.0918 0.0767 0.0802 0.0749 0.0805
va: 2.1076 2.1374 2.1916 2.1957 3.0824 3.7483 3.8823 3.8248 3.9013 3.9101 3.9100 4.1818 3.7230 3.9097 3.9328 3.9433 3.5718 3.6219 3.9165 3.9314 3.9012 3.8946 4.2581 4.2784 1.0032 1.0302 1.0066 1.0047 1.0052 1.0212 1.0046 0.9978 1.0135 1.0205 1.0028 0.9957 1.0058 1.0142 1.0085 1.0158 0.9988 1.0195 1.0082 1.0192 1.0079 1.0091 1.0118 1.0097 1.0114
dispcorr: -0.026778522 hartree
energy: -1094.876081156730
dipole: 7.18652 -8.19747 -1.01095 18.07906 -17.39193 0.68713 -7.93797 7.00342 -0.93455
magnitude: 1.53868 au
magnitude: 3.91102 debye
