program: Gaussian 09
title: 000073318
version: EM64L-G09RevD.01
frameworkgroup: C1[X(C10H13N5O5)]
method: RPBEPBE
basis: SDD
operation: Freq
keyword: #p
keyword: freq=noraman
keyword: PBEPBE/SDD
title: #p freq=noraman PBEPBE/SDD
converged: YES YES NO NO
title: Mulliken charges:
elementType: O O O O O N N N N N C C C C C C C C C C H H H H H H H H H H H H H
charge: -0.344618 -0.450796 -0.431027 -0.251655 -0.252449 -0.268969 -0.413964 -0.422988 -0.050790 -0.620723 -0.023796 -0.484088 -0.147608 -0.062329 -0.382460 0.372566 0.159585 0.046449 0.011519 0.155645 0.280109 0.253124 0.298975 0.263680 0.239006 0.217028 0.241584 0.344928 0.351562 0.364361 0.345251 0.352863 0.310024
chargesum: 0.00000
title: Mulliken charges with hydrogens summed into heavy atoms:
elementType: O O O O O N N N N N C C C C C C C C C C
charge: -0.344618 -0.105868 -0.085776 -0.251655 -0.252449 -0.268969 -0.062403 -0.058627 -0.050790 0.042164 0.256313 0.068011 0.116072 0.176677 0.076152 0.372566 0.159585 0.046449 0.011519 0.155645
polarizability: 2.03246576e+02 3.88749216e+00 1.78229529e+02 -1.49675275e+01 1.35376298e+01 9.93906948e+01
1716.lowfreq: -8.6122 -7.8263 0.0002 0.0005 0.0007 5.5206 18.0131 23.3683 59.5350
frequency: 17.7175 23.2990 59.5333 79.9169 97.4069 102.1632 118.2615 151.7278 202.8812 206.1112 216.8877 231.4851 253.8335 261.3496 271.8621 279.8460 289.0634 290.0013 329.4390 344.0715 407.9081 413.4348 443.6043 485.8240 496.6297 519.1978 550.9867 596.7266 600.6546 611.5803 625.0027 648.6633 659.1918 682.0454 695.9313 733.1414 744.4217 747.7163 825.3890 835.1895 844.8930 853.9142 883.2855 926.7875 951.0366 973.5493 975.7577 986.8543 1028.3947 1046.3629 1058.1385 1082.1881 1104.8676 1142.0825 1145.5700 1165.3899 1168.1952 1198.0541 1245.3920 1253.0996 1266.1686 1283.2367 1292.3724 1310.5062 1314.5388 1320.9539 1330.9441 1349.8481 1363.7438 1380.5347 1395.5506 1423.1171 1444.9215 1471.0635 1524.8003 1571.0313 1591.1043 1626.9064 1655.9792 1689.1630 2994.8716 3009.9571 3013.8336 3025.1077 3066.7410 3091.2834 3144.0071 3474.3050 3551.7150 3570.4352 3573.8219 3615.4115 3704.3145
redmass: 7.0309 5.9017 8.1736 4.5608 7.6427 3.5845 5.0452 7.6215 5.4016 5.3234 6.4014 4.1398 1.8376 1.2003 1.2425 7.0253 3.9575 1.9516 3.7469 8.3705 2.9764 4.4863 6.9163 3.2654 5.0734 1.1439 7.7516 1.5313 2.8461 8.0080 3.7483 3.2724 1.3750 7.8022 9.8139 7.2986 10.6318 4.6638 4.8495 2.8686 5.8571 4.9908 2.6233 3.0324 3.0745 2.3931 3.8115 3.0980 3.1017 1.6887 2.9393 1.8572 4.2129 2.9073 1.5085 1.5792 3.1155 1.3884 1.3134 1.7904 1.5648 1.4895 1.4350 2.2456 1.3916 1.7370 1.3895 1.4136 1.2390 1.4275 3.6789 6.1798 1.0981 1.0818 5.9034 4.5972 2.1620 2.2859 8.3934 10.4449 1.0654 1.0856 1.0874 1.0866 1.0652 1.1002 1.1023 1.0792 1.0451 1.0665 1.0667 1.0810 1.1051
irintensity: 0.5866 0.6322 4.4095 2.8960 0.9118 9.6904 5.7031 3.9381 11.2457 23.8498 5.7180 8.3222 34.6903 134.2304 135.8036 0.2562 8.6400 76.8006 8.0424 0.4017 7.6950 10.0668 9.7928 17.3325 7.1411 209.2761 1.4483 43.9962 49.8285 15.6693 49.6298 26.8317 108.3332 6.8747 10.7560 28.9861 17.4221 20.3755 4.8263 34.7770 12.0612 5.0839 23.1488 49.2234 57.7286 53.3614 139.0196 54.5858 105.8029 25.8897 4.5093 6.7149 20.8937 16.3997 19.7620 28.5511 20.1529 4.5719 17.0106 45.7501 34.7098 20.8778 38.6321 93.3343 2.4088 3.3753 22.1390 47.2350 7.2023 4.8805 139.7830 50.6885 13.2259 9.5933 266.8369 342.6743 220.3695 471.1942 467.6521 460.2575 41.1765 22.0809 38.0266 20.6529 5.5595 21.8405 2.5062 191.2316 96.3791 7.1706 10.9001 108.3182 43.9005
temp: 298.150 k
press: 1.00000 atm
elementType: 8 8 8 8 8 7 7 7 7 7 6 6 6 6 6 6 6 6 6 6 1 1 1 1 1 1 1 1 1 1 1 1 1
symmnumber: 1
zpe: 649729.0 jmol-1
zpe.correction: 0.247469 hartree
zpe.thermalcorrener: 0.266226 hartree
zpe.thermalcorrenthalpy: 0.267170 hartree
zpe.thermalcorrgfe: 0.199442 hartree
zpe.sumelectzpe: -1037.257044 hartree
zpe.sumelectthermal: -1037.238287 hartree
zpe.sumelectthermalent: -1037.237343 hartree
zpe.sumelectthermalfe: -1037.305071 hartree
dipole: 8.2106 -7.5532 -2.5633
dipole: 11.4471
quadrupole: -140.9425 -103.2527 -120.2253
quadrupole: -5.7109 4.5996 5.9036
quadrupole: -19.4690 18.2208 1.2482 -5.7109 4.5996 5.9036
hfenergy: -1037.5045129 hartree
pointgroup: C01 [X(C10H13N5O5)]
dipole: 3.3406784 2.7104127 1.3327369 debye
polarizability: 204.2947017|-5.4872167|171.5179815|9.3762599|26.1830232|105.0541159 unknown
InChI: InChI=1S/C10H13N5O5/c11-9-13-7-6(8(18)14-9)12-10(19)15(7)5-1-3(17)4(2-16)20-5/h3-5,12-13,16-17H,1-2,11H2
charge 0 multiplicity 1
33 atoms
O  1.557621 0.798003 0.553356
O  4.179873 -0.690161 1.331904
O  4.152915 2.002815 -1.906383
O  0.159226 -3.128612 -0.822897
O  -4.645685 -0.451261 -0.729871
N  -0.05625 -0.880735 0.060854
N  -1.90065 -1.886453 -0.741767
N  -1.160946 1.250046 0.781326
N  -3.545535 1.349484 0.354583
N  -2.44384 3.153314 1.366363
C  1.287661 -0.671175 0.613538
C  2.422707 -1.342353 -0.181888
C  3.600306 -0.372853 0.016777
C  2.928301 1.02009 0.004997
C  2.820637 1.628854 -1.408576
C  -1.143694 -0.023069 0.236138
C  -0.530552 -2.110368 -0.551956
C  -2.28933 -0.618289 -0.263295
C  -3.584281 0.057396 -0.255701
C  -2.419734 1.882934 0.816518
H  1.309785 -0.953645 1.682954
H  2.150084 -1.429478 -1.245488
H  2.661253 -2.346883 0.191938
H  4.358484 -0.450958 -0.785222
H  3.437288 1.724336 0.690948
H  2.123388 2.490178 -1.395431
H  2.440744 0.885359 -2.128263
H  5.014795 -0.174096 1.461975
H  -2.532381 -2.566571 -1.160529
H  -0.262109 1.703705 0.979678
H  4.429193 2.863764 -1.503521
H  -3.350455 3.614459 1.382881
H  -1.667319 3.543923 1.893161
