program: Orca
programVersion: 5.0.2
elementType: O O O O N C C C C C C C C C C C C C C C C C C C H H H H H H H H H H H H H H H H H H H H H H H H H
charge: 0
multiplicity: 1
keywords: wb97x-d3
keywords: def2-TZVPP
keywords: def2/J RIJCOSX
keywords: DEFGRID2
keywords: scfconv7
keywords: smallprint printgap noloewdin
keywords: NOSOSCF
formula: C19H25NO4
InChI: InChI=1/C19H25NO4/c1-11(2)9-14-15(19(14,3)4)18(23)24-10-20-16(21)12-7-5-6-8-13(12)17(20)22/h9,14-15H,5-8,10H2,1-4H3
49 atoms
O  1.207154 -1.759848 -1.214886
O  1.392606 -1.187995 0.939938
O  -1.342249 -0.722564 -2.750297
O  -1.500644 -2.177443 1.562776
N  -1.083779 -1.669257 -0.660025
C  4.118207 0.06688 0.162151
C  3.100092 1.121057 -0.105023
C  2.910211 -0.285979 -0.681012
C  5.41748 0.156791 -0.605623
C  4.299392 -0.495918 1.55065
C  2.209368 1.657756 0.95266
C  1.78906 -1.107389 -0.189391
C  1.018974 2.215868 0.734728
C  0.040481 -2.507052 -0.931885
C  0.194414 2.761974 1.859865
C  0.395392 2.326529 -0.622656
C  -2.676022 -0.01841 -0.857585
C  -2.696871 -0.424944 0.410947
C  -3.5479 1.036776 -1.432839
C  -3.576846 0.129511 1.469629
C  -4.673484 1.365674 -0.449123
C  -4.16577 1.457465 0.990082
C  -1.643534 -0.799416 -1.591447
C  -1.703055 -1.519767 0.584046
H  3.374265 1.843228 -0.869765
H  3.092192 -0.384568 -1.744832
H  6.130522 0.793045 -0.078349
H  5.87214 -0.828575 -0.720779
H  5.277097 0.575747 -1.602982
H  3.375323 -0.576473 2.114215
H  4.740734 -1.492523 1.499293
H  4.98851 0.137441 2.113032
H  2.571563 1.602369 1.973621
H  0.177266 -3.172149 -0.078533
H  -0.137923 -3.092207 -1.831254
H  -0.752381 2.220102 1.942221
H  0.705439 2.685685 2.818414
H  -0.057587 3.812447 1.69405
H  -0.618703 1.91845 -0.608187
H  0.302744 3.372337 -0.927705
H  0.950461 1.800401 -1.396888
H  -2.946464 1.926416 -1.647878
H  -3.949079 0.714112 -2.396249
H  -4.370093 -0.58887 1.700074
H  -3.015493 0.257578 2.397938
H  -5.155205 2.300586 -0.738899
H  -5.441697 0.589385 -0.509843
H  -4.972861 1.76798 1.65507
H  -3.395895 2.233156 1.052401
totalener: -1094.84883114 hartree
nucrepener: 2225.80041047 hartree
electener: -3320.64924161 hartree
oneelecener: -5913.69808840 hartree
twoeener: 2593.04884678 hartree
kineticenergy: 1090.10240546 hartree
xcener: -105.973980936126 hartree
chargesum: -0.0000000
charge: -0.263380 -0.367201 -0.312329 -0.297915 -0.113027 0.138597 -0.051770 -0.122393 -0.241791 -0.284710 -0.167634 0.337919 0.001793 0.085349 -0.206264 -0.235012 -0.139883 -0.053881 -0.065504 -0.095087 -0.130347 -0.133579 0.233262 0.266610 0.095817 0.088896 0.088250 0.091233 0.071677 0.108993 0.085106 0.088116 0.084717 0.127225 0.122134 0.067545 0.082764 0.085865 0.030557 0.107118 0.097468 0.089876 0.098413 0.099011 0.099927 0.079590 0.075194 0.082037 0.070647
qa: -0.2634 -0.3672 -0.3123 -0.2979 -0.1130 0.1386 -0.0518 -0.1224 -0.2418 -0.2847 -0.1676 0.3379 0.0018 0.0853 -0.2063 -0.2350 -0.1399 -0.0539 -0.0655 -0.0951 -0.1303 -0.1336 0.2333 0.2666 0.0958 0.0889 0.0882 0.0912 0.0717 0.1090 0.0851 0.0881 0.0847 0.1272 0.1221 0.0675 0.0828 0.0859 0.0306 0.1071 0.0975 0.0899 0.0984 0.0990 0.0999 0.0796 0.0752 0.0820 0.0706
va: 2.1258 2.1096 2.1984 2.2154 3.0596 3.7312 3.8825 3.8287 3.9022 3.9094 3.9051 4.1604 3.7200 3.9254 3.9473 3.9473 3.6046 3.5458 3.9199 3.9222 3.8915 3.8931 4.2580 4.2608 1.0044 1.0296 1.0044 1.0050 1.0074 1.0190 1.0051 0.9974 1.0119 1.0147 0.9961 1.0005 1.0150 0.9970 1.0125 1.0014 1.0128 1.0084 1.0199 1.0089 1.0166 1.0119 1.0090 1.0136 1.0109
dispcorr: -0.028039388 hartree
energy: -1094.876870527395
dipole: 6.49911 -6.98676 -0.48765 19.81203 -18.89757 0.91446 6.26100 -6.44119 -0.18019
magnitude: 1.05191 au
magnitude: 2.67374 debye
