program: Gaussian 09
title: 000062344
version: EM64L-G09RevD.01
frameworkgroup: C1[X(C17H19N3)]
method: RPBEPBE
basis: SDD
operation: Freq
keyword: #pfreq=noraman
keyword: PBEPBE/SDD
title: #p freq=noraman PBEPBE/SDD
converged: YES YES NO NO
title: Mulliken charges:
elementType: N N N C C C C C C C C C C C C C C C C C H H H H H H H H H H H H H H H H H H H
charge: -0.067339 -0.157999 -0.158075 0.463693 0.463633 -0.055266 -0.055301 -0.485639 0.426384 0.426527 -0.520383 -0.520391 -0.447878 -0.447885 -0.372559 -0.372601 -0.645279 -0.644244 -0.645260 -0.644219 0.248788 0.270762 0.270759 0.227010 0.227022 0.234544 0.234548 0.232595 0.217165 0.232714 0.239223 0.238886 0.212798 0.217139 0.232653 0.232626 0.239449 0.238623 0.212777
chargesum: 0.00000
title: Mulliken charges with hydrogens summed into heavy atoms:
elementType: N N N C C C C C C C C C C C C C C C C C
charge: -0.067339 -0.157999 -0.158075 0.463693 0.463633 -0.055266 -0.055301 -0.236851 0.426384 0.426527 -0.249621 -0.249632 -0.220867 -0.220863 -0.138015 -0.138053 0.037195 0.046663 0.037158 0.046630
polarizability: 4.92856164e+02 1.28044916e-03 2.07823300e+02 -2.53261670e-02 7.48131833e-02 9.96219815e+01
1716.lowfreq: -16.3274 -8.5359 -0.0005 0.0003 0.0006 3.5077 40.8090 41.7242 63.7253
frequency: 40.7842 41.6789 63.7252 67.2680 93.9861 97.1725 102.4943 142.9546 144.7229 183.6262 191.3481 196.0235 237.8021 252.4588 256.4175 275.8456 339.8880 345.4402 349.8293 389.9873 438.8151 456.0796 464.3281 472.5910 483.6253 501.6825 515.6819 573.0778 586.6828 627.1481 631.7206 651.2361 689.7928 724.0208 744.8082 780.8016 792.5103 797.9087 806.1018 828.1440 864.0474 868.3020 892.1469 910.1252 919.2187 950.7395 960.5934 960.8214 970.1671 1055.8973 1056.1335 1106.7831 1106.8218 1108.9892 1109.0501 1135.3486 1139.3583 1153.8021 1163.7691 1190.7654 1224.7873 1237.3500 1258.9311 1259.4011 1277.2303 1308.2087 1317.7011 1344.9360 1368.5295 1369.0013 1408.8132 1413.5765 1428.8221 1430.6889 1448.5366 1457.2633 1460.5169 1460.5619 1462.6277 1474.5619 1474.6068 1477.0280 1493.8212 1494.4071 1496.2019 1506.3971 1514.6673 1518.3709 1539.1550 1595.6124 1617.5900 1652.1886 2938.5006 2938.6366 2946.1243 2946.8997 3004.7811 3004.8843 3007.3386 3007.4690 3092.1189 3092.4679 3102.8019 3103.1305 3107.1581 3113.5141 3114.3136 3165.4751 3165.7168 3176.8279 3177.3359
redmass: 3.4160 2.7348 3.3857 2.7031 1.8318 1.5972 3.9496 1.9548 1.6424 3.6059 1.1727 1.4388 2.3883 2.5242 4.6601 3.5997 5.3010 4.2685 3.8018 3.9905 3.6291 3.0934 2.8272 2.6984 4.1568 3.7799 3.6775 4.4793 7.0456 4.0369 7.1545 2.9710 5.6697 7.1228 2.7773 1.8474 5.2424 1.8661 1.6551 4.1266 1.7346 1.9633 5.5204 1.4435 4.4888 1.3394 1.4537 2.4636 2.4041 1.5059 1.5063 1.2404 1.2403 1.3190 1.3192 1.9480 1.6628 1.6162 1.4753 1.2385 2.1504 1.8318 2.4138 2.1245 2.7322 2.2457 4.0361 2.8434 2.4891 4.1884 5.0987 3.8584 1.1470 1.1590 1.3891 1.4457 1.0407 1.0410 3.1365 1.0478 1.0501 2.2161 1.4339 1.1468 1.5406 1.2450 1.6677 3.1438 4.8410 6.3005 6.1592 6.9707 1.0366 1.0366 1.0391 1.0393 1.0992 1.0991 1.1030 1.1030 1.0963 1.0963 1.0943 1.0942 1.0919 1.0890 1.0889 1.0931 1.0930 1.0902 1.0904
irintensity: 5.4105 0.1466 0.0033 2.8438 6.7714 0.0116 2.1596 0.8495 0.0008 1.0989 0.3527 0.0086 0.0028 5.0411 1.0230 0.8312 2.9905 0.0005 0.4254 4.3397 0.1306 0.4674 9.4227 0.0003 0.3762 11.4788 0.2380 0.2410 4.8303 0.0034 1.3164 14.3847 5.4028 0.0413 0.0004 17.0274 0.1735 51.5758 0.0007 0.3221 0.0020 65.4462 0.7599 34.4614 22.1591 0.0002 11.7349 6.2170 35.0334 11.8534 37.6891 0.0842 0.1088 1.0509 1.1466 2.4890 2.9290 51.2363 2.2959 89.2796 2.9091 29.3861 53.9579 14.9388 10.5218 0.5957 142.9986 303.1594 0.7825 30.1161 25.9313 4.8803 7.7271 3.8337 156.1028 1.6765 1.1843 3.1207 14.9888 7.0738 32.3222 143.5566 4.4691 0.1341 159.0847 3.1342 229.9702 81.0678 15.5809 0.0295 1382.1767 46.9829 76.6658 139.9872 283.4440 27.5406 0.5432 0.8603 39.4679 138.1541 4.4156 4.7231 67.3815 49.9090 7.9010 4.6972 34.9221 26.8682 22.3066 17.1770 6.9843
temp: 298.150 k
press: 1.00000 atm
elementType: 7 7 7 6 6 6 6 6 6 6 6 6 6 6 6 6 6 6 6 6 1 1 1 1 1 1 1 1 1 1 1 1 1 1 1 1 1 1 1
symmnumber: 1
zpe: 843371.3 jmol-1
zpe.correction: 0.321223 hartree
zpe.thermalcorrener: 0.340069 hartree
zpe.thermalcorrenthalpy: 0.341013 hartree
zpe.thermalcorrgfe: 0.273885 hartree
zpe.sumelectzpe: -822.027282 hartree
zpe.sumelectthermal: -822.008436 hartree
zpe.sumelectthermalent: -822.007492 hartree
zpe.sumelectthermalfe: -822.074620 hartree
dipole: -0.0022 0.0822 0.0075
dipole: 0.0826
quadrupole: -63.0849 -105.1592 -126.0812
quadrupole: -0.0016 0.0779 0.0043
quadrupole: 35.0235 -7.0508 -27.9728 -0.0016 0.0779 0.0043
hfenergy: -822.3485048 hartree
pointgroup: C01 [X(C17H19N3)]
dipole: -0.0008088 0.0324388 0.0018686 debye
polarizability: 492.8478792|-0.4844622|207.7114549|1.7068317|-3.4934668|99.7421108 unknown
InChI: InChI=1S/C17H19N3/c1-19(2)14-7-5-12-9-13-6-8-15(20(3)4)11-17(13)18-16(12)10-14/h5-11H,1-4H3
charge 0 multiplicity 1
39 atoms
N  0.001932 0.866619 -0.012629
N  -4.860198 0.971676 -0.037384
N  4.864597 0.954386 0.000442
C  -1.227367 -1.299292 0.052604
C  1.223048 -1.303623 0.061635
C  -1.180296 0.163022 0.005549
C  1.181494 0.158849 0.014451
C  -0.00351 -2.00619 0.079535
C  -3.660401 0.25203 -0.007377
C  3.661888 0.238912 0.021516
C  -2.405634 0.899503 -0.023183
C  2.409675 0.890959 -0.003819
C  -2.513963 -1.937134 0.068959
C  2.507128 -1.94616 0.087436
C  -3.689368 -1.201102 0.040781
C  3.685348 -1.21433 0.06874
C  -6.156035 0.280995 -0.018293
C  -4.817064 2.437631 -0.090157
C  6.157675 0.259663 0.041639
C  4.827137 2.420706 -0.04439
H  -0.005571 -3.103798 0.114493
H  -2.311638 1.987035 -0.057403
H  2.320074 1.978834 -0.038376
H  -2.560401 -3.033116 0.104436
H  2.549229 -3.042327 0.122438
H  -4.648277 -1.726716 0.054848
H  4.642257 -1.743305 0.089504
H  -6.283967 -0.389455 -0.89245
H  -6.964614 1.028369 -0.049156
H  -6.292496 -0.32424 0.900997
H  -4.283692 2.796617 -0.993945
H  -4.301437 2.863012 0.795034
H  -5.842974 2.837788 -0.11518
H  6.969167 1.004127 0.015577
H  6.280297 -0.340045 0.966563
H  6.294646 -0.416729 -0.82645
H  4.299402 2.78591 -0.948792
H  4.309024 2.843836 0.840619
H  5.854682 2.817083 -0.062911
