program: Orca
programVersion: 5.0.2
elementType: O O O O N C C C C C C C C C C C C C C C C C C C H H H H H H H H H H H H H H H H H H H H H H H H H
charge: 0
multiplicity: 1
keywords: wb97x-d3
keywords: def2-TZVPP
keywords: def2/J RIJCOSX
keywords: DEFGRID2
keywords: scfconv7
keywords: smallprint printgap noloewdin
keywords: NOSOSCF
formula: C19H25NO4
InChI: InChI=1/C19H25NO4/c1-11(2)9-14-15(19(14,3)4)18(23)24-10-20-16(21)12-7-5-6-8-13(12)17(20)22/h9,14-15H,5-8,10H2,1-4H3
49 atoms
O  0.692034 -0.682783 -0.227566
O  2.314886 -1.375194 1.136557
O  -1.817707 -2.425215 -1.727559
O  -1.928984 0.633992 1.640888
N  -1.54367 -1.057727 0.113697
C  4.311791 0.132873 -0.668944
C  3.627209 1.258875 0.030407
C  2.801619 0.163011 -0.649413
C  4.929213 0.441203 -2.014755
C  5.097178 -0.895947 0.107908
C  3.634755 1.415013 1.506463
C  1.967899 -0.720232 0.19128
C  2.649685 1.971649 2.212174
C  -0.240095 -1.452739 0.518034
C  2.740988 2.115311 3.700589
C  1.378662 2.477287 1.600918
C  -3.454881 -0.746203 -1.130682
C  -3.48402 0.151904 -0.1469
C  -4.503154 -0.909627 -2.168222
C  -4.577661 1.127165 0.087431
C  -5.427145 0.309748 -2.157116
C  -5.804235 0.72598 -0.734869
C  -2.203052 -1.541829 -1.015209
C  -2.254714 -0.000595 0.675958
H  3.603007 2.196556 -0.519668
H  2.320986 0.457093 -1.575647
H  5.944626 0.822724 -1.892946
H  4.983068 -0.455668 -2.634348
H  4.360333 1.191222 -2.566277
H  6.129772 -0.556806 0.213731
H  4.700172 -1.092918 1.09818
H  5.117505 -1.844593 -0.430623
H  4.515317 1.062472 2.03362
H  -0.128433 -1.275658 1.587336
H  -0.104854 -2.515517 0.315168
H  3.678326 1.724035 4.093445
H  2.65912 3.162916 4.000953
H  1.921783 1.58458 4.191343
H  0.513965 1.946135 2.005383
H  1.231094 3.533941 1.838239
H  1.352004 2.37198 0.51838
H  -4.046646 -1.051796 -3.150311
H  -5.067837 -1.826389 -1.96935
H  -4.816175 1.181199 1.151926
H  -4.234219 2.129258 -0.189316
H  -4.926422 1.143926 -2.656959
H  -6.326563 0.09684 -2.736572
H  -6.311849 -0.106135 -0.238494
H  -6.516902 1.551467 -0.762085
totalener: -1094.85223063 hartree
nucrepener: 2109.37982483 hartree
electener: -3204.23205546 hartree
oneelecener: -5680.79505684 hartree
twoeener: 2476.56300137 hartree
kineticenergy: 1090.09964014 hartree
xcener: -105.972124452476 hartree
chargesum: -0.0000000
charge: -0.263018 -0.373563 -0.314277 -0.336625 -0.119039 0.143422 -0.057117 -0.101230 -0.245053 -0.275589 -0.198853 0.329169 0.006776 0.075938 -0.207450 -0.255557 -0.097066 -0.070966 -0.075609 -0.072910 -0.135134 -0.134940 0.265235 0.264745 0.093272 0.084221 0.087604 0.091594 0.069447 0.085460 0.105226 0.087080 0.084821 0.126257 0.126062 0.076598 0.082344 0.090187 0.099726 0.093433 0.079149 0.095253 0.092710 0.094133 0.092960 0.075471 0.080055 0.075241 0.080407
qa: -0.2630 -0.3736 -0.3143 -0.3366 -0.1190 0.1434 -0.0571 -0.1012 -0.2451 -0.2756 -0.1989 0.3292 0.0068 0.0759 -0.2075 -0.2556 -0.0971 -0.0710 -0.0756 -0.0729 -0.1351 -0.1349 0.2652 0.2647 0.0933 0.0842 0.0876 0.0916 0.0694 0.0855 0.1052 0.0871 0.0848 0.1263 0.1261 0.0766 0.0823 0.0902 0.0997 0.0934 0.0791 0.0953 0.0927 0.0941 0.0930 0.0755 0.0801 0.0752 0.0804
va: 2.0954 2.1092 2.1993 2.1721 3.1068 3.7363 3.8992 3.8326 3.9051 3.9084 3.8979 4.1698 3.7413 3.9130 3.9399 3.9475 3.6491 3.6293 3.9247 3.9240 3.9000 3.8975 4.2731 4.2472 1.0061 1.0291 1.0050 1.0047 1.0072 0.9977 1.0184 1.0054 1.0132 1.0055 1.0026 1.0109 0.9987 0.9995 1.0088 1.0026 1.0093 1.0191 1.0080 1.0192 1.0083 1.0087 1.0118 1.0088 1.0119
dispcorr: -0.024165516 hartree
energy: -1094.876396144445
dipole: 10.48467 -11.80478 -1.32011 13.59831 -12.76293 0.83538 0.50801 -1.22894 -0.72094
magnitude: 1.72055 au
magnitude: 4.37329 debye
