program: Orca
programVersion: 5.0.2
elementType: O O O O N C C C C C C C C C C C C C C C C C C C H H H H H H H H H H H H H H H H H H H H H H H H H
charge: 0
multiplicity: 1
keywords: wb97x-d3
keywords: def2-TZVPP
keywords: def2/J RIJCOSX
keywords: DEFGRID2
keywords: scfconv7
keywords: smallprint printgap noloewdin
keywords: NOSOSCF
formula: C19H25NO4
InChI: InChI=1/C19H25NO4/c1-11(2)9-14-15(19(14,3)4)18(23)24-10-20-16(21)12-7-5-6-8-13(12)17(20)22/h9,14-15H,5-8,10H2,1-4H3
49 atoms
O  1.179918 -1.120139 -0.480023
O  2.688467 -2.158141 -1.750694
O  -1.43551 0.056487 -2.420927
O  -1.235043 -2.203323 1.519211
N  -1.084934 -1.343865 -0.617587
C  3.629092 -0.215415 1.161754
C  3.13144 0.921777 0.333978
C  3.425897 -0.418988 -0.329337
C  5.071803 -0.175133 1.610482
C  2.725468 -0.881349 2.171554
C  1.775628 1.504289 0.504006
C  2.420408 -1.322131 -0.928201
C  1.105016 2.172701 -0.433381
C  0.146725 -1.931947 -1.01493
C  -0.215916 2.816626 -0.138683
C  1.591055 2.329262 -1.840602
C  -2.799393 0.180751 -0.426836
C  -2.73659 -0.474723 0.732084
C  -3.773386 1.254313 -0.746822
C  -3.634431 -0.246835 1.892057
C  -4.416996 1.755536 0.546785
C  -4.833357 0.599124 1.456639
C  -1.721422 -0.322968 -1.319148
C  -1.619523 -1.454794 0.664929
H  3.88887 1.662109 0.085948
H  4.344685 -0.459429 -0.903272
H  5.713589 0.316362 0.878382
H  5.166097 0.371094 2.550895
H  5.4613 -1.182108 1.769462
H  1.676346 -0.895664 1.890655
H  3.035086 -1.914831 2.335548
H  2.803725 -0.36369 3.129761
H  1.330519 1.414951 1.490436
H  0.212706 -2.945769 -0.619412
H  0.194132 -1.965726 -2.102822
H  -0.5853 2.562861 0.854997
H  -0.141716 3.905598 -0.201237
H  -0.968471 2.518832 -0.871904
H  0.893928 1.851604 -2.533622
H  1.642759 3.383345 -2.124842
H  2.572951 1.88943 -2.003501
H  -3.281557 2.068399 -1.283775
H  -4.532574 0.864115 -1.432418
H  -3.957356 -1.199507 2.317628
H  -3.072621 0.255224 2.686561
H  -3.70461 2.396041 1.075549
H  -5.280853 2.37951 0.313286
H  -5.547755 -0.03637 0.92539
H  -5.354204 0.98094 2.33583
totalener: -1094.84887667 hartree
nucrepener: 2223.05507428 hartree
electener: -3317.90395095 hartree
oneelecener: -5907.70162478 hartree
twoeener: 2589.79767383 hartree
kineticenergy: 1090.10433028 hartree
xcener: -105.974229731934 hartree
chargesum: -0.0000000
charge: -0.249439 -0.362755 -0.321997 -0.317047 -0.093341 0.128136 -0.036660 -0.141998 -0.246726 -0.275460 -0.178623 0.350790 -0.008485 0.068939 -0.233203 -0.251012 -0.075920 -0.068743 -0.089824 -0.071391 -0.126697 -0.135170 0.210765 0.244051 0.097695 0.088220 0.071291 0.085733 0.093610 0.090227 0.094576 0.087607 0.088179 0.126802 0.126778 0.076149 0.106171 0.067925 0.103049 0.091255 0.084304 0.101275 0.100940 0.094975 0.092191 0.074936 0.081118 0.076213 0.080587
qa: -0.2494 -0.3628 -0.3220 -0.3170 -0.0933 0.1281 -0.0367 -0.1420 -0.2467 -0.2755 -0.1786 0.3508 -0.0085 0.0689 -0.2332 -0.2510 -0.0759 -0.0687 -0.0898 -0.0714 -0.1267 -0.1352 0.2108 0.2441 0.0977 0.0882 0.0713 0.0857 0.0936 0.0902 0.0946 0.0876 0.0882 0.1268 0.1268 0.0761 0.1062 0.0679 0.1030 0.0913 0.0843 0.1013 0.1009 0.0950 0.0922 0.0749 0.0811 0.0762 0.0806
va: 2.0875 2.1438 2.1762 2.1907 3.1079 3.7350 3.8124 3.8671 3.9125 3.9257 3.8568 4.1983 3.7333 3.9228 3.9422 3.9503 3.5815 3.6221 3.9184 3.9212 3.8867 3.8962 4.2456 4.2615 1.0066 1.0279 1.0087 1.0039 1.0041 1.0115 1.0052 0.9998 1.0063 0.9995 1.0093 1.0088 0.9997 1.0058 1.0055 1.0016 1.0075 1.0107 1.0086 1.0177 1.0098 1.0117 1.0128 1.0086 1.0120
dispcorr: -0.028622408 hartree
energy: -1094.877499077367
dipole: 2.52611 -3.77005 -1.24394 17.69268 -16.46646 1.22622 9.95436 -8.99294 0.96142
magnitude: 1.99382 au
magnitude: 5.06789 debye
