program: Orca
programVersion: 5.0.2
elementType: O O O O N C C C C C C C C C C C C C C C C C C C H H H H H H H H H H H H H H H H H H H H H H H H H
charge: 0
multiplicity: 1
keywords: wb97x-d3
keywords: def2-TZVPP
keywords: def2/J RIJCOSX
keywords: DEFGRID2
keywords: scfconv7
keywords: smallprint printgap noloewdin
keywords: NOSOSCF
formula: C19H25NO4
InChI: InChI=1/C19H25NO4/c1-11(2)9-14-15(19(14,3)4)18(23)24-10-20-16(21)12-7-5-6-8-13(12)17(20)22/h9,14-15H,5-8,10H2,1-4H3
49 atoms
O  1.215863 -1.33737 -0.474406
O  2.769097 -2.753968 -1.21019
O  -1.237481 -2.366142 1.773121
O  -1.31757 -0.350374 -2.302524
N  -1.036689 -1.648724 -0.414052
C  3.444218 0.281824 0.751018
C  3.171636 0.881195 -0.593638
C  3.456503 -0.607984 -0.480357
C  4.806333 0.5307 1.358422
C  2.354995 0.175482 1.791891
C  1.852767 1.414561 -1.026721
C  2.474463 -1.678258 -0.760745
C  1.2605 2.496474 -0.52032
C  0.190658 -2.277163 -0.760677
C  -0.055982 2.97787 -1.05432
C  1.83116 3.318152 0.595285
C  -2.654105 -0.625545 0.868065
C  -2.678051 -0.035614 -0.327026
C  -3.548632 -0.289777 2.003729
C  -3.590061 1.068666 -0.715193
C  -4.701647 0.586218 1.507844
C  -4.220216 1.669745 0.542196
C  -1.581876 -1.656602 0.870592
C  -1.625534 -0.645121 -1.181082
H  4.014012 1.418267 -1.025912
H  4.441815 -0.917695 -0.808486
H  5.587621 0.599913 0.600483
H  4.811398 1.46541 1.923534
H  5.080347 -0.272352 2.044808
H  1.353938 0.232383 1.37667
H  2.440794 -0.757212 2.351684
H  2.459795 0.99343 2.507054
H  1.365246 0.90973 -1.853479
H  0.310802 -3.183916 -0.168286
H  0.188085 -2.535479 -1.819498
H  -0.42663 2.344906 -1.859479
H  -0.811845 2.998173 -0.263156
H  0.020652 3.999827 -1.434113
H  1.920025 4.364595 0.292508
H  1.173214 3.303576 1.468038
H  2.815743 2.981015 0.912639
H  -3.920682 -1.200671 2.478045
H  -2.969568 0.228327 2.775164
H  -3.0464 1.825187 -1.285434
H  -4.361541 0.684491 -1.39042
H  -5.439433 -0.04311 1.001721
H  -5.213082 1.039342 2.358254
H  -3.482366 2.302119 1.045397
H  -5.049559 2.32215 0.265498
totalener: -1094.84863363 hartree
nucrepener: 2213.01913475 hartree
electener: -3307.86776837 hartree
oneelecener: -5887.49946179 hartree
twoeener: 2579.63169342 hartree
kineticenergy: 1090.09663674 hartree
xcener: -105.972270662834 hartree
chargesum: -0.0000000
charge: -0.256670 -0.360061 -0.314409 -0.323701 -0.108744 0.052679 -0.010913 -0.071379 -0.246417 -0.253533 -0.192133 0.309997 -0.011896 0.075905 -0.246650 -0.248011 -0.066228 -0.045028 -0.072114 -0.107410 -0.135855 -0.124208 0.236947 0.221054 0.100472 0.086825 0.074189 0.079199 0.097496 0.085858 0.112023 0.080644 0.097897 0.126438 0.126914 0.090771 0.073295 0.098762 0.097167 0.089445 0.083314 0.094914 0.093245 0.097124 0.101720 0.076984 0.080282 0.072567 0.081231
qa: -0.2567 -0.3601 -0.3144 -0.3237 -0.1087 0.0527 -0.0109 -0.0714 -0.2464 -0.2535 -0.1921 0.3100 -0.0119 0.0759 -0.2467 -0.2480 -0.0662 -0.0450 -0.0721 -0.1074 -0.1359 -0.1242 0.2369 0.2211 0.1005 0.0868 0.0742 0.0792 0.0975 0.0859 0.1120 0.0806 0.0979 0.1264 0.1269 0.0908 0.0733 0.0988 0.0972 0.0894 0.0833 0.0949 0.0932 0.0971 0.1017 0.0770 0.0803 0.0726 0.0812
va: 2.0832 2.1494 2.1943 2.1774 3.1216 3.7175 3.7992 3.8413 3.9192 3.8961 3.8801 4.2462 3.6708 3.9212 3.9418 3.9427 3.6319 3.5823 3.9197 3.9319 3.8983 3.8868 4.2621 4.2512 1.0054 1.0271 1.0089 1.0064 1.0028 1.0105 1.0063 1.0012 1.0285 1.0054 1.0015 1.0148 0.9927 1.0028 1.0041 0.9977 1.0090 1.0180 1.0093 1.0156 1.0092 1.0084 1.0119 1.0117 1.0126
dispcorr: -0.028246204 hartree
energy: -1094.876879830921
dipole: 2.09024 -3.32791 -1.23767 24.54837 -22.95100 1.59737 10.40540 -9.59790 0.80749
magnitude: 2.17611 au
magnitude: 5.53123 debye
