program: Gaussian 09
title: 000073293
version: EM64L-G09RevD.01
frameworkgroup: C1[X(C18H11N2O)]
method: RPBEPBE
basis: SDD
operation: Freq
keyword: #p
keyword: freq=noraman
keyword: PBEPBE/SDD
title: #p freq=noraman PBEPBE/SDD
converged: NO YES NO NO
title: Mulliken charges:
elementType: O N N C C C C C C C C C C C C C C C C C C H H H H H H H H H H H
charge: -0.162846 -0.264929 -0.453347 0.218430 0.127711 0.251924 0.337416 0.201555 0.180628 0.250644 0.017388 -0.216339 -0.311152 -0.342376 -0.359667 -0.349416 -0.354288 -0.188206 -0.222525 -0.230393 -0.177847 0.373480 0.271301 0.272493 0.263840 0.257289 0.291690 0.269755 0.262387 0.267576 0.258820 0.259002
chargesum: 1.00000
title: Mulliken charges with hydrogens summed into heavy atoms:
elementType: O N N C C C C C C C C C C C C C C C C C C
charge: -0.162846 -0.264929 -0.079867 0.218430 0.127711 0.251924 0.337416 0.201555 0.180628 0.250644 0.017388 0.054962 -0.038659 -0.078536 -0.102378 -0.057726 -0.084533 0.074182 0.045051 0.028427 0.081155
polarizability: 4.68485712e+02 9.83606239e+00 2.16803165e+02 2.05120689e-03 -1.16365752e-02 7.42958564e+01
1716.lowfreq: -4.5490 -0.0010 -0.0002 0.0007 1.6532 7.9065 46.3548 87.2859 104.5722
frequency: 46.3478 87.2852 104.5716 122.9609 145.4514 172.5627 232.9238 248.5024 251.7510 302.4295 313.8735 338.5512 410.9345 431.6205 461.5024 478.0402 497.9524 513.6217 538.4597 556.2249 559.6480 593.9808 615.8241 639.7300 645.7445 666.6311 692.7040 699.5569 732.9265 743.1412 761.2349 768.2286 784.0710 793.6132 808.0885 830.0420 847.5842 879.7035 893.3741 914.6965 942.2232 949.3086 966.4567 974.5658 1004.2447 1011.8230 1013.8519 1017.8094 1056.8441 1076.6580 1107.4859 1125.6096 1172.3892 1178.6047 1183.1154 1190.4044 1216.1166 1222.9761 1237.4470 1292.9987 1316.2712 1328.9708 1349.1725 1374.8548 1406.4524 1411.0191 1427.5287 1442.6272 1451.2712 1460.3423 1483.9789 1513.2563 1563.0534 1589.1081 1599.0400 1612.0012 1626.9183 1631.0227 1677.9960 3151.8828 3155.7295 3157.4307 3164.2604 3170.1078 3172.4994 3183.9746 3184.4618 3186.8088 3211.5469 3560.8204
redmass: 5.9466 4.7508 5.8794 5.5709 4.5366 5.2563 8.0672 5.2002 5.3784 8.1553 4.5552 4.4515 3.4938 3.4276 6.9155 4.2722 5.1844 3.3641 6.9721 3.3389 7.0323 7.0160 4.1284 6.4315 7.2086 1.2125 3.8227 6.6600 6.4144 4.1077 2.1348 1.7038 1.6967 6.5405 3.2649 1.5926 5.3888 1.4618 1.4256 5.7712 7.4369 1.3796 1.3858 1.4042 1.3604 1.3697 2.1826 2.1892 3.9896 3.1462 2.0058 1.7835 1.9025 1.2570 1.2164 2.1156 2.3115 2.5533 1.5291 1.5360 2.3800 2.3864 2.2789 3.7842 4.8157 5.6331 2.8993 2.5779 2.4166 2.6447 3.2794 4.5747 6.6020 7.1379 7.3296 8.2397 8.1925 7.7602 10.3965 1.0878 1.0887 1.0909 1.0912 1.0961 1.0958 1.0989 1.0931 1.1005 1.0973 1.0819
irintensity: 1.1902 1.3398 1.9341 0.0107 2.1858 0.1883 2.4722 0.3850 4.1245 5.0171 2.5324 0.0000 0.6485 16.0565 0.1108 0.6795 4.6289 1.2093 2.7506 7.4257 2.6015 1.1852 0.1564 1.3817 13.5690 77.6828 20.5856 1.5028 2.3004 1.3197 39.9991 35.3713 159.9085 0.8700 0.4938 19.0900 16.6828 2.7200 0.2705 2.9634 56.4975 1.1437 2.2739 2.3183 0.4483 0.0006 0.9151 0.4303 0.4025 50.7532 18.9515 47.8972 7.0177 20.4673 47.5039 174.3199 3.9971 20.0767 29.2545 44.0114 18.0413 31.5229 16.4093 28.8953 7.2768 2.2475 30.4633 40.2855 77.7880 17.7563 2.3953 219.6320 7.3266 18.8907 96.0970 84.5696 109.5012 231.6990 21.6262 0.2987 1.1852 0.5682 1.4713 3.2826 0.3433 8.7721 1.4814 4.9110 1.5407 99.3312
temp: 298.150 k
press: 1.00000 atm
elementType: 8 7 7 6 6 6 6 6 6 6 6 6 6 6 6 6 6 6 6 6 6 1 1 1 1 1 1 1 1 1 1 1
symmnumber: 1
zpe: 637797.6 jmol-1
zpe.correction: 0.242924 hartree
zpe.thermalcorrener: 0.257307 hartree
zpe.thermalcorrenthalpy: 0.258251 hartree
zpe.thermalcorrgfe: 0.201770 hartree
zpe.sumelectzpe: -875.670702 hartree
zpe.sumelectthermal: -875.656320 hartree
zpe.sumelectthermalent: -875.655376 hartree
zpe.sumelectthermalfe: -875.711857 hartree
dipole: -0.3137 -3.7106 0.0006
dipole: 3.7238
quadrupole: -30.8614 -92.3496 -123.4708
quadrupole: 8.4493 -0.0011 -0.0020
quadrupole: 51.3659 -10.1223 -41.2436 8.4493 -0.0011 -0.0020
hfenergy: -875.9136267 hartree
pointgroup: C01 [X(C18H11N2O1)]
dipole: -0.1213117 -1.4600395 0.0002555 debye
polarizability: 468.4570604|10.195997|216.8318161|0.0020678|-0.0116336|74.2958564 unknown
InChI: InChI=1S/C18H11N2O/c21-18-13-6-2-4-8-15(13)20-10-9-12-11-5-1-3-7-14(11)19-16(12)17(18)20/h1-10,19H
charge 1 multiplicity 1
32 atoms
O  -1.288077 2.694328 -0.000817
N  -1.294131 -0.867755 -0.000507
N  1.678289 1.371502 -0.000506
C  -0.614047 0.347524 -0.000617
C  0.776276 0.332639 -0.000502
C  1.500055 -0.937469 -0.000289
C  -2.732284 -0.601921 -0.000532
C  2.904353 -0.601864 -0.000231
C  -2.931405 0.804387 -0.000575
C  2.99032 0.839322 -0.000412
C  -1.601775 1.473662 -0.001012
C  -0.653639 -2.083298 -0.000355
C  0.752126 -2.136794 -0.00024
C  -3.78915 -1.51483 -0.000336
C  4.093831 -1.377874 -0.000078
C  -4.232637 1.336448 -0.000306
C  4.221958 1.51519 -0.000393
C  -5.102706 -0.967699 -0.000179
C  -5.323881 0.430961 -0.000146
C  5.329086 -0.707306 -0.000097
C  5.389167 0.718571 -0.000243
H  1.420037 2.360616 -0.000608
H  -1.277132 -2.978229 -0.000239
H  1.237109 -3.115572 -0.00012
H  -3.645486 -2.599304 -0.000265
H  4.055775 -2.471771 0.000029
H  -4.388221 2.419566 -0.000323
H  4.285723 2.607156 -0.000478
H  -5.959651 -1.648577 -0.000021
H  -6.348764 0.813061 0.000002
H  6.261032 -1.279978 0.000012
H  6.367948 1.209109 -0.000216
