program: Orca
programVersion: 5.0.2
elementType: O O O O N C C C C C C C C C C C C C C C C C C C H H H H H H H H H H H H H H H H H H H H H H H H H
charge: 0
multiplicity: 1
keywords: wb97x-d3
keywords: def2-TZVPP
keywords: def2/J RIJCOSX
keywords: DEFGRID2
keywords: scfconv7
keywords: smallprint printgap noloewdin
keywords: NOSOSCF
formula: C19H25NO4
InChI: InChI=1/C19H25NO4/c1-11(2)9-14-15(19(14,3)4)18(23)24-10-20-16(21)12-7-5-6-8-13(12)17(20)22/h9,14-15H,5-8,10H2,1-4H3
49 atoms
O  1.155185 -1.325801 -0.459929
O  2.593387 -2.705537 -1.454997
O  -1.279711 -0.157703 -2.407606
O  -1.466324 -2.203367 1.650538
N  -1.12287 -1.46871 -0.512972
C  3.535645 0.057879 0.786814
C  3.210628 0.805978 -0.468813
C  3.429851 -0.697017 -0.526645
C  4.943281 0.189889 1.322892
C  2.511873 -0.118324 1.882858
C  1.892711 1.428627 -0.762575
C  2.378319 -1.681029 -0.863558
C  1.370863 2.465174 -0.106729
C  0.073521 -2.169694 -0.825212
C  0.040749 3.035088 -0.500352
C  2.039042 3.143593 1.049879
C  -2.759886 0.149381 -0.520154
C  -2.813185 -0.446605 0.670788
C  -3.664664 1.23371 -0.975449
C  -3.774956 -0.10963 1.749769
C  -4.866862 1.323267 -0.033828
C  -4.448105 1.227877 1.433541
C  -1.655643 -0.457126 -1.308195
C  -1.748499 -1.484577 0.733791
H  4.049073 1.351829 -0.897628
H  4.376513 -1.014026 -0.948147
H  5.220719 -0.686463 1.911297
H  5.678516 0.299113 0.524699
H  5.027995 1.064391 1.9717
H  2.606864 -1.101384 2.347054
H  2.686339 0.625138 2.662718
H  1.488107 -0.001345 1.543143
H  1.343571 1.035208 -1.611019
H  0.100894 -3.102453 -0.262047
H  0.098927 -2.392158 -1.891655
H  -0.388132 2.514391 -1.356034
H  -0.66986 2.970233 0.329096
H  0.122667 4.094502 -0.756005
H  2.155506 4.2118 0.850058
H  1.43477 3.061839 1.956934
H  3.025298 2.738585 1.266282
H  -3.112773 2.179429 -0.994458
H  -3.981781 1.056823 -2.005569
H  -4.51902 -0.908416 1.834102
H  -3.266019 -0.077366 2.71563
H  -5.406519 2.254781 -0.210429
H  -5.564505 0.512811 -0.264158
H  -5.314544 1.367476 2.081458
H  -3.753968 2.041641 1.663131
totalener: -1094.84903122 hartree
nucrepener: 2204.70319722 hartree
electener: -3299.55222844 hartree
oneelecener: -5870.88617089 hartree
twoeener: 2571.33394245 hartree
kineticenergy: 1090.10037344 hartree
xcener: -105.973335548253 hartree
chargesum: -0.0000000
charge: -0.256905 -0.361151 -0.322609 -0.315692 -0.101147 0.051561 -0.016377 -0.071257 -0.246469 -0.252389 -0.193382 0.312862 -0.011231 0.072934 -0.236078 -0.250315 -0.074121 -0.068082 -0.067246 -0.073326 -0.131502 -0.135942 0.219462 0.242599 0.100565 0.087080 0.096920 0.074332 0.079934 0.108210 0.079210 0.093635 0.101675 0.125391 0.126500 0.080580 0.076495 0.097159 0.097405 0.090860 0.083371 0.089119 0.097614 0.092876 0.094427 0.080827 0.076384 0.081518 0.073717
qa: -0.2569 -0.3612 -0.3226 -0.3157 -0.1011 0.0516 -0.0164 -0.0713 -0.2465 -0.2524 -0.1934 0.3129 -0.0112 0.0729 -0.2361 -0.2503 -0.0741 -0.0681 -0.0672 -0.0733 -0.1315 -0.1359 0.2195 0.2426 0.1006 0.0871 0.0969 0.0743 0.0799 0.1082 0.0792 0.0936 0.1017 0.1254 0.1265 0.0806 0.0765 0.0972 0.0974 0.0909 0.0834 0.0891 0.0976 0.0929 0.0944 0.0808 0.0764 0.0815 0.0737
va: 2.0841 2.1467 2.1770 2.1928 3.1163 3.7191 3.8082 3.8414 3.9191 3.8941 3.8831 4.2397 3.6817 3.9183 3.9414 3.9441 3.6073 3.6374 3.9173 3.9232 3.8960 3.8965 4.2445 4.2558 1.0054 1.0271 1.0029 1.0088 1.0064 1.0066 1.0004 1.0104 1.0260 1.0037 1.0042 1.0140 0.9945 1.0020 1.0039 0.9972 1.0088 1.0108 1.0205 1.0073 1.0192 1.0120 1.0093 1.0119 1.0111
dispcorr: -0.027898001 hartree
energy: -1094.876929224397
dipole: 3.22685 -4.42681 -1.19996 22.76737 -21.23404 1.53333 11.96531 -11.11134 0.85397
magnitude: 2.12609 au
magnitude: 5.40410 debye
