program: Orca
programVersion: 5.0.2
elementType: O O O O N C C C C C C C C C C C C C C C C C C C H H H H H H H H H H H H H H H H H H H H H H H H H
charge: 0
multiplicity: 1
keywords: wb97x-d3
keywords: def2-TZVPP
keywords: def2/J RIJCOSX
keywords: DEFGRID2
keywords: scfconv7
keywords: smallprint printgap noloewdin
keywords: NOSOSCF
formula: C19H25NO4
InChI: InChI=1/C19H25NO4/c1-11(2)9-14-15(19(14,3)4)18(23)24-10-20-16(21)12-7-5-6-8-13(12)17(20)22/h9,14-15H,5-8,10H2,1-4H3
49 atoms
O  0.400971 -0.401659 0.024342
O  2.010162 -0.962845 1.460148
O  -1.847205 -2.591973 -1.319678
O  -2.452442 0.950356 1.472141
N  -1.819275 -0.919004 0.271583
C  3.987459 0.169838 -0.656297
C  3.575138 1.361295 0.144946
C  2.51082 0.423505 -0.439653
C  4.472224 0.435552 -2.063428
C  4.693347 -1.001664 -0.017874
C  3.793179 1.480511 1.599092
C  1.668542 -0.387684 0.459816
C  3.651975 2.595224 2.320631
C  -0.525957 -1.128571 0.818877
C  3.901494 2.583969 3.799376
C  3.221732 3.924818 1.778832
C  -3.659789 -1.00236 -1.107025
C  -3.834739 0.037248 -0.2916
C  -4.616703 -1.434712 -2.155922
C  -5.024041 0.925138 -0.282469
C  -5.646339 -0.327971 -2.395576
C  -6.15271 0.273757 -1.08397
C  -2.355053 -1.643401 -0.791103
C  -2.656634 0.142017 0.610543
H  3.621428 2.300548 -0.395289
H  1.973484 0.816657 -1.294812
H  3.973821 1.294375 -2.515334
H  5.544765 0.637199 -2.067408
H  4.292605 -0.427593 -2.706621
H  5.76148 -0.789046 0.05243
H  4.330925 -1.248853 0.974201
H  4.575598 -1.891989 -0.637856
H  4.089912 0.582521 2.12583
H  -0.512781 -0.777162 1.85047
H  -0.293868 -2.193789 0.799385
H  4.651756 3.326543 4.081762
H  2.99059 2.837366 4.347524
H  4.24117 1.610959 4.15078
H  3.007372 3.918327 0.712572
H  2.318341 4.268347 2.288686
H  3.987446 4.683087 1.961102
H  -4.084052 -1.685061 -3.076091
H  -5.107655 -2.36017 -1.837758
H  -5.335587 1.131379 0.743847
H  -4.753798 1.896158 -0.709893
H  -5.191114 0.460495 -3.001857
H  -6.482367 -0.720354 -2.97628
H  -6.612869 -0.513573 -0.47994
H  -6.935086 1.006948 -1.28475
totalener: -1094.85376294 hartree
nucrepener: 2054.09991148 hartree
electener: -3148.95367442 hartree
oneelecener: -5570.16908183 hartree
twoeener: 2421.21540740 hartree
kineticenergy: 1090.10000431 hartree
xcener: -105.973136935759 hartree
chargesum: 0.0000000
charge: -0.266322 -0.396231 -0.316567 -0.316978 -0.127484 0.104652 -0.010964 -0.053901 -0.235332 -0.271736 -0.188875 0.340059 -0.037029 0.094503 -0.209197 -0.244655 -0.092031 -0.088507 -0.074000 -0.075164 -0.136996 -0.135348 0.263423 0.263097 0.080514 0.077361 0.068985 0.088800 0.090219 0.090462 0.104792 0.085571 0.095393 0.122447 0.122122 0.079938 0.086144 0.079817 0.077462 0.088360 0.086402 0.094817 0.092844 0.093985 0.093199 0.075841 0.080530 0.075274 0.080305
qa: -0.2663 -0.3962 -0.3166 -0.3170 -0.1275 0.1047 -0.0110 -0.0539 -0.2353 -0.2717 -0.1889 0.3401 -0.0370 0.0945 -0.2092 -0.2447 -0.0920 -0.0885 -0.0740 -0.0752 -0.1370 -0.1353 0.2634 0.2631 0.0805 0.0774 0.0690 0.0888 0.0902 0.0905 0.1048 0.0856 0.0954 0.1224 0.1221 0.0799 0.0861 0.0798 0.0775 0.0884 0.0864 0.0948 0.0928 0.0940 0.0932 0.0758 0.0805 0.0753 0.0803
va: 2.1172 2.0899 2.1984 2.1984 3.1177 3.7707 3.8213 3.8551 3.8993 3.9109 3.9176 4.1582 3.8079 3.9026 3.9400 3.9478 3.6282 3.6209 3.9247 3.9260 3.8988 3.8974 4.2757 4.2763 1.0109 1.0297 1.0079 1.0042 1.0053 0.9991 1.0228 1.0028 1.0217 1.0058 1.0021 0.9976 0.9985 1.0128 1.0133 0.9995 0.9983 1.0191 1.0078 1.0192 1.0083 1.0086 1.0116 1.0088 1.0117
dispcorr: -0.021795056 hartree
energy: -1094.875557996302
dipole: 15.23656 -16.34431 -1.10775 13.68804 -13.02555 0.66248 -1.35616 0.42074 -0.93542
magnitude: 1.59405 au
magnitude: 4.05176 debye
