program: Orca
programVersion: 5.0.2
elementType: O O O O N C C C C C C C C C C C C C C C C C C C H H H H H H H H H H H H H H H H H H H H H H H H H
charge: 0
multiplicity: 1
keywords: wb97x-d3
keywords: def2-TZVPP
keywords: def2/J RIJCOSX
keywords: DEFGRID2
keywords: scfconv7
keywords: smallprint printgap noloewdin
keywords: NOSOSCF
formula: C19H25NO4
InChI: InChI=1/C19H25NO4/c1-11(2)9-14-15(19(14,3)4)18(23)24-10-20-16(21)12-7-5-6-8-13(12)17(20)22/h9,14-15H,5-8,10H2,1-4H3
49 atoms
O  0.770311 -1.64583 0.233444
O  2.090296 -0.722342 1.793696
O  -1.266842 0.709745 1.540674
O  -2.305947 -3.269324 -0.407708
N  -1.480717 -1.452579 0.757888
C  4.123911 -0.195668 -0.476594
C  3.115949 0.884658 -0.725613
C  2.660986 -0.567393 -0.535476
C  4.94023 -0.640304 -1.669153
C  4.913669 -0.232225 0.809521
C  2.800162 1.937356 0.255018
C  1.855897 -0.958354 0.640342
C  2.602507 3.230743 -0.014669
C  -0.226586 -1.976806 1.185573
C  2.281856 4.194895 1.088894
C  2.671117 3.856558 -1.375436
C  -3.154076 0.023924 0.190025
C  -3.457151 -1.141599 -0.380433
C  -3.976688 1.256446 0.106225
C  -4.660876 -1.39692 -1.210484
C  -5.366024 0.910373 -0.433893
C  -5.293195 -0.06254 -1.611457
C  -1.867692 -0.122694 0.9225
C  -2.388574 -2.125394 -0.05695
H  3.041218 1.1950 -1.761672
H  2.338247 -1.05394 -1.448625
H  5.814138 0.001413 -1.794417
H  5.294779 -1.664584 -1.540257
H  4.367462 -0.60289 -2.597013
H  5.245458 -1.249528 1.023589
H  5.804005 0.389153 0.698386
H  4.366079 0.121076 1.676185
H  2.714133 1.629477 1.289755
H  0.022498 -1.578222 2.167377
H  -0.306603 -3.061507 1.23491
H  3.023776 4.996114 1.141547
H  1.314782 4.675665 0.920636
H  2.24426 3.706173 2.061213
H  3.455844 4.616659 -1.407825
H  2.869397 3.151143 -2.179104
H  1.734893 4.369095 -1.609855
H  -4.042431 1.736626 1.085056
H  -3.475182 1.980387 -0.544212
H  -4.398422 -1.990148 -2.089235
H  -5.370578 -2.007193 -0.642431
H  -5.961582 0.462817 0.367121
H  -5.884627 1.822883 -0.731509
H  -4.702312 0.386416 -2.415162
H  -6.290588 -0.233819 -2.019001
totalener: -1094.85192549 hartree
nucrepener: 2095.46011223 hartree
electener: -3190.31203772 hartree
oneelecener: -5653.02608326 hartree
twoeener: 2462.71404555 hartree
kineticenergy: 1090.08569503 hartree
xcener: -105.970786785170 hartree
chargesum: 0.0000000
charge: -0.273109 -0.382279 -0.309099 -0.320654 -0.114743 0.100685 0.031372 -0.110935 -0.240718 -0.249531 -0.210970 0.370430 -0.061451 0.067565 -0.199931 -0.242881 -0.076525 -0.097298 -0.074870 -0.074338 -0.135360 -0.135007 0.250510 0.267186 0.083626 0.084063 0.089094 0.089078 0.069394 0.085865 0.082821 0.102870 0.107919 0.139772 0.112115 0.078898 0.081583 0.083298 0.087279 0.075880 0.084692 0.093839 0.093384 0.094703 0.091487 0.075200 0.079962 0.075372 0.079756
qa: -0.2731 -0.3823 -0.3091 -0.3207 -0.1147 0.1007 0.0314 -0.1109 -0.2407 -0.2495 -0.2110 0.3704 -0.0615 0.0676 -0.1999 -0.2429 -0.0765 -0.0973 -0.0749 -0.0743 -0.1354 -0.1350 0.2505 0.2672 0.0836 0.0841 0.0891 0.0891 0.0694 0.0859 0.0828 0.1029 0.1079 0.1398 0.1121 0.0789 0.0816 0.0833 0.0873 0.0759 0.0847 0.0938 0.0934 0.0947 0.0915 0.0752 0.0800 0.0754 0.0798
va: 2.1147 2.1147 2.2015 2.1938 3.0861 3.7286 3.8036 3.8705 3.9082 3.9168 3.9091 4.1436 3.8331 3.8957 3.9385 3.9432 3.6057 3.6458 3.9280 3.9245 3.8975 3.8993 4.2885 4.2817 1.0096 1.0295 1.0040 1.0050 1.0080 1.0031 1.0018 1.0208 1.0252 1.0170 1.0081 0.9971 0.9993 1.0135 0.9992 1.0166 0.9992 1.0190 1.0084 1.0193 1.0082 1.0087 1.0117 1.0089 1.0116
dispcorr: -0.022445070 hartree
energy: -1094.874370557039
dipole: 12.37477 -13.40130 -1.02652 19.98910 -19.35451 0.63460 -9.38338 8.36671 -1.01667
magnitude: 1.57800 au
magnitude: 4.01095 debye
