program: Orca
programVersion: 5.0.2
elementType: O O O O N C C C C C C C C C C C C C C C C C C C H H H H H H H H H H H H H H H H H H H H H H H H H
charge: 0
multiplicity: 1
keywords: wb97x-d3
keywords: def2-TZVPP
keywords: def2/J RIJCOSX
keywords: DEFGRID2
keywords: scfconv7
keywords: smallprint printgap noloewdin
keywords: NOSOSCF
formula: C19H25NO4
InChI: InChI=1/C19H25NO4/c1-11(2)9-14-15(19(14,3)4)18(23)24-10-20-16(21)12-7-5-6-8-13(12)17(20)22/h9,14-15H,5-8,10H2,1-4H3
49 atoms
O  0.425869 -1.058947 -0.080048
O  1.710377 -0.240808 -1.723513
O  -1.822357 0.9117 -1.266188
O  -2.432521 -3.246904 0.470528
N  -1.809621 -1.2969 -0.601214
C  2.443335 1.862664 0.491645
C  3.553285 0.857213 0.526592
C  2.106776 0.38343 0.564767
C  2.174189 2.645283 1.754975
C  2.173785 2.656746 -0.762027
C  4.456503 0.610448 -0.615081
C  1.439604 -0.30942 -0.555435
C  5.790668 0.656357 -0.573617
C  -0.483932 -1.630722 -1.003924
C  6.600124 0.377772 -1.805382
C  6.608915 0.977845 0.640682
C  -3.662333 -0.057931 -0.025776
C  -3.838482 -1.276536 0.484333
C  -4.62771 1.0638 0.085015
C  -5.025574 -1.71123 1.262426
C  -5.980835 0.530032 0.558976
C  -5.828395 -0.482491 1.694833
C  -2.345244 -0.016606 -0.715733
C  -2.647901 -2.109092 0.158927
H  4.025131 0.755661 1.498151
H  1.764221 0.042491 1.534743
H  2.375831 2.05859 2.652427
H  2.802618 3.537055 1.794646
H  1.132916 2.970051 1.797961
H  1.121668 2.941972 -0.814858
H  2.767817 3.572183 -0.743408
H  2.416199 2.126041 -1.677332
H  3.993431 0.374452 -1.564104
H  -0.383201 -2.715012 -0.981897
H  -0.295344 -1.265003 -2.011815
H  5.972145 0.144173 -2.663698
H  7.224982 1.234886 -2.069031
H  7.278741 -0.464683 -1.647618
H  6.016502 1.215402 1.521838
H  7.26779 0.143764 0.896782
H  7.258211 1.835582 0.445869
H  -4.2361 1.80834 0.785731
H  -4.720909 1.581556 -0.872178
H  -5.638027 -2.378079 0.646923
H  -4.717751 -2.305739 2.125229
H  -6.613728 1.359299 0.878251
H  -6.494191 0.055222 -0.28216
H  -6.810449 -0.791423 2.055819
H  -5.323829 -0.003687 2.539103
totalener: -1094.85262535 hartree
nucrepener: 2066.13956705 hartree
electener: -3160.99219240 hartree
oneelecener: -5594.29319762 hartree
twoeener: 2433.30100522 hartree
kineticenergy: 1090.09378765 hartree
xcener: -105.973076592957 hartree
chargesum: -0.0000000
charge: -0.276658 -0.390211 -0.320245 -0.319467 -0.113342 0.102709 0.021138 -0.104128 -0.245599 -0.252733 -0.224926 0.372204 -0.037732 0.068668 -0.209719 -0.243902 -0.072795 -0.096714 -0.074285 -0.074973 -0.135093 -0.134396 0.253383 0.266199 0.085067 0.081469 0.069917 0.088239 0.089856 0.096972 0.083735 0.100314 0.116107 0.113672 0.139595 0.082368 0.081180 0.081666 0.075958 0.088048 0.084663 0.092760 0.094160 0.091565 0.095338 0.080039 0.075164 0.079507 0.075254
qa: -0.2767 -0.3902 -0.3202 -0.3195 -0.1133 0.1027 0.0211 -0.1041 -0.2456 -0.2527 -0.2249 0.3722 -0.0377 0.0687 -0.2097 -0.2439 -0.0728 -0.0967 -0.0743 -0.0750 -0.1351 -0.1344 0.2534 0.2662 0.0851 0.0815 0.0699 0.0882 0.0899 0.0970 0.0837 0.1003 0.1161 0.1137 0.1396 0.0824 0.0812 0.0817 0.0760 0.0880 0.0847 0.0928 0.0942 0.0916 0.0953 0.0800 0.0752 0.0795 0.0753
va: 2.1089 2.0998 2.1892 2.1949 3.0891 3.7450 3.8026 3.9157 3.9102 3.9266 3.9065 4.1295 3.7837 3.8907 3.9413 3.9470 3.6113 3.6518 3.9272 3.9236 3.8983 3.8990 4.2820 4.2818 1.0103 1.0302 1.0081 1.0043 1.0048 1.0045 1.0021 1.0187 1.0276 1.0108 1.0138 1.0125 0.9984 0.9976 1.0152 0.9983 0.9997 1.0086 1.0188 1.0082 1.0192 1.0118 1.0087 1.0117 1.0087
dispcorr: -0.022434019 hartree
energy: -1094.875059369466
dipole: 17.44493 -18.57376 -1.12883 16.52489 -15.96525 0.55963 6.72643 -5.73898 0.98745
magnitude: 1.60078 au
magnitude: 4.06887 debye
