program: Orca
programVersion: 5.0.2
elementType: O O O O N C C C C C C C C C C C C C C C C C C C H H H H H H H H H H H H H H H H H H H H H H H H H
charge: 0
multiplicity: 1
keywords: wb97x-d3
keywords: def2-TZVPP
keywords: def2/J RIJCOSX
keywords: DEFGRID2
keywords: scfconv7
keywords: smallprint printgap noloewdin
keywords: NOSOSCF
formula: C19H25NO4
InChI: InChI=1/C19H25NO4/c1-11(2)9-14-15(19(14,3)4)18(23)24-10-20-16(21)12-7-5-6-8-13(12)17(20)22/h9,14-15H,5-8,10H2,1-4H3
49 atoms
O  0.987023 -1.596579 -0.766998
O  2.197028 -1.669476 1.122097
O  -1.906388 -2.07978 -2.436257
O  -1.206927 -0.579518 1.802694
N  -1.276792 -1.613168 -0.263404
C  4.245505 0.164192 -0.28336
C  3.120468 1.094863 0.023422
C  2.849587 -0.237908 -0.692616
C  5.146339 0.557323 -1.433021
C  4.993139 -0.549145 0.816993
C  2.618562 1.335342 1.39637
C  2.026839 -1.23871 0.016959
C  1.454913 1.920592 1.682545
C  -0.063932 -2.363741 -0.208229
C  1.016272 2.137861 3.097427
C  0.491447 2.396032 0.637132
C  -3.052979 -0.413309 -1.109976
C  -2.84794 0.024448 0.131823
C  -4.103797 0.089204 -2.029659
C  -3.651236 1.071937 0.810998
C  -4.66895 1.403852 -1.487256
C  -4.933617 1.330657 0.017011
C  -2.046934 -1.465519 -1.416437
C  -1.693102 -0.711612 0.714281
H  3.035562 1.947548 -0.644295
H  2.620513 -0.155952 -1.749049
H  5.617913 -0.320125 -1.878859
H  4.601484 1.077442 -2.222298
H  5.93925 1.222666 -1.086866
H  4.371942 -0.83246 1.659995
H  5.451094 -1.461053 0.430606
H  5.79759 0.091959 1.182708
H  3.24612 1.013463 2.219415
H  0.145647 -2.633938 0.825321
H  -0.181171 -3.261662 -0.812034
H  0.108944 1.566074 3.303898
H  1.776967 1.829329 3.812997
H  0.78246 3.189198 3.284578
H  -0.524791 2.086527 0.889239
H  0.479284 3.488387 0.585875
H  0.71646 2.015932 -0.357988
H  -3.697074 0.218333 -3.035141
H  -4.894059 -0.662686 -2.124303
H  -3.87541 0.774538 1.837745
H  -3.054856 1.987161 0.892696
H  -3.958969 2.210822 -1.69058
H  -5.587294 1.658818 -2.018238
H  -5.64854 0.527694 0.218938
H  -5.401286 2.254092 0.361576
totalener: -1094.84984841 hartree
nucrepener: 2176.28408584 hartree
electener: -3271.13393425 hartree
oneelecener: -5814.60897647 hartree
twoeener: 2543.47504222 hartree
kineticenergy: 1090.09379104 hartree
xcener: -105.971186163629 hartree
chargesum: 0.0000000
charge: -0.269000 -0.362397 -0.316505 -0.312944 -0.103743 0.150684 -0.062542 -0.110553 -0.242747 -0.277425 -0.175884 0.339660 0.009356 0.073656 -0.208681 -0.263965 -0.083778 -0.075584 -0.077054 -0.066053 -0.134625 -0.135433 0.264327 0.214761 0.089583 0.084363 0.090551 0.069986 0.088719 0.102086 0.085803 0.088385 0.087956 0.138059 0.114132 0.095900 0.075804 0.079604 0.050591 0.108419 0.085758 0.094873 0.092349 0.096704 0.092415 0.075886 0.080624 0.077209 0.080710
qa: -0.2690 -0.3624 -0.3165 -0.3129 -0.1037 0.1507 -0.0625 -0.1106 -0.2427 -0.2774 -0.1759 0.3397 0.0094 0.0737 -0.2087 -0.2640 -0.0838 -0.0756 -0.0771 -0.0661 -0.1346 -0.1354 0.2643 0.2148 0.0896 0.0844 0.0906 0.0700 0.0887 0.1021 0.0858 0.0884 0.0880 0.1381 0.1141 0.0959 0.0758 0.0796 0.0506 0.1084 0.0858 0.0949 0.0923 0.0967 0.0924 0.0759 0.0806 0.0772 0.0807
va: 2.1100 2.1314 2.1961 2.1810 3.0942 3.7504 3.8758 3.8364 3.8995 3.9082 3.9058 4.1727 3.7421 3.9039 3.9345 3.9421 3.6425 3.5779 3.9274 3.9169 3.8965 3.9033 4.2783 4.2593 1.0032 1.0302 1.0053 1.0066 1.0045 1.0228 1.0043 0.9981 1.0137 1.0207 1.0037 1.0054 1.0135 0.9965 1.0169 1.0000 1.0088 1.0190 1.0074 1.0194 1.0067 1.0091 1.0115 1.0091 1.0116
dispcorr: -0.026168402 hartree
energy: -1094.876016814734
dipole: 7.23378 -8.30445 -1.07067 19.84198 -18.72439 1.11760 3.35677 -3.86381 -0.50703
magnitude: 1.62863 au
magnitude: 4.13965 debye
