program: Orca
programVersion: 5.0.2
elementType: O O O O N C C C C C C C C C C C C C C C C C C C H H H H H H H H H H H H H H H H H H H H H H H H H
charge: 0
multiplicity: 1
keywords: wb97x-d3
keywords: def2-TZVPP
keywords: def2/J RIJCOSX
keywords: DEFGRID2
keywords: scfconv7
keywords: smallprint printgap noloewdin
keywords: NOSOSCF
formula: C19H25NO4
InChI: InChI=1/C19H25NO4/c1-11(2)9-14-15(19(14,3)4)18(23)24-10-20-16(21)12-7-5-6-8-13(12)17(20)22/h9,14-15H,5-8,10H2,1-4H3
49 atoms
O  1.170739 -0.693905 -0.767263
O  2.664511 -1.587736 -2.152607
O  -1.096848 -2.720142 0.674859
O  -1.667982 0.968757 -1.926689
N  -1.091495 -0.999342 -0.865135
C  3.469921 -0.253807 1.19197
C  3.387258 1.006383 0.395596
C  3.470879 -0.333511 -0.323903
C  4.789313 -0.589229 1.848583
C  2.280642 -0.706297 2.005531
C  2.188667 1.883069 0.436877
C  2.419006 -0.932936 -1.172562
C  1.608456 2.493442 -0.59602
C  0.130825 -1.289523 -1.5285
C  0.446596 3.418415 -0.395473
C  2.038522 2.321681 -2.019623
C  -2.757967 -0.960997 0.722016
C  -2.912554 0.13024 -0.027538
C  -3.643056 -1.359666 1.844569
C  -3.975808 1.149205 0.157529
C  -4.9310 -0.534835 1.795418
C  -4.651153 0.942115 1.515141
C  -1.568328 -1.709264 0.236268
C  -1.849164 0.149767 -1.067727
H  4.322495 1.55871 0.323185
H  4.44095 -0.546998 -0.757893
H  5.639581 -0.258547 1.250805
H  4.865701 -0.107481 2.825325
H  4.889441 -1.665431 1.999885
H  2.231396 -1.795019 2.055529
H  2.382796 -0.335901 3.027776
H  1.330806 -0.348595 1.620377
H  1.794352 2.080496 1.430263
H  0.264416 -2.369482 -1.590216
H  0.100154 -0.873762 -2.535658
H  -0.416482 3.094143 -0.979451
H  0.148419 3.480263 0.650963
H  0.691058 4.428609 -0.733704
H  1.231822 1.876186 -2.607359
H  2.253287 3.291052 -2.47585
H  2.926073 1.702799 -2.131292
H  -3.857244 -2.429589 1.795264
H  -3.118227 -1.208063 2.793294
H  -3.554511 2.15393 0.076444
H  -4.703942 1.067623 -0.655914
H  -5.582827 -0.933774 1.012866
H  -5.474717 -0.642067 2.73513
H  -4.005301 1.342174 2.302213
H  -5.579244 1.513968 1.556728
totalener: -1094.84933040 hartree
nucrepener: 2199.41334752 hartree
electener: -3294.26267792 hartree
oneelecener: -5860.53516384 hartree
twoeener: 2566.27248592 hartree
kineticenergy: 1090.09939177 hartree
xcener: -105.973028575866 hartree
chargesum: 0.0000000
charge: -0.247562 -0.361354 -0.313916 -0.335790 -0.099402 0.136515 -0.022206 -0.138126 -0.246633 -0.272646 -0.214933 0.324880 -0.000772 0.058692 -0.229258 -0.252475 -0.070705 -0.062164 -0.074420 -0.072478 -0.136500 -0.135641 0.234988 0.242632 0.096683 0.094179 0.071889 0.084240 0.092459 0.102866 0.086598 0.081274 0.088875 0.129387 0.129760 0.094152 0.072915 0.092738 0.095693 0.094404 0.091527 0.094916 0.093407 0.092385 0.094155 0.076605 0.080868 0.076196 0.081101
qa: -0.2476 -0.3614 -0.3139 -0.3358 -0.0994 0.1365 -0.0222 -0.1381 -0.2466 -0.2726 -0.2149 0.3249 -0.0008 0.0587 -0.2293 -0.2525 -0.0707 -0.0622 -0.0744 -0.0725 -0.1365 -0.1356 0.2350 0.2426 0.0967 0.0942 0.0719 0.0842 0.0925 0.1029 0.0866 0.0813 0.0889 0.1294 0.1298 0.0942 0.0729 0.0927 0.0957 0.0944 0.0915 0.0949 0.0934 0.0924 0.0942 0.0766 0.0809 0.0762 0.0811
va: 2.0866 2.1428 2.1937 2.1678 3.1129 3.6893 3.8201 3.8487 3.9144 3.9289 3.8730 4.2017 3.7069 3.9152 3.9313 3.9416 3.6362 3.6393 3.9228 3.9227 3.8982 3.8964 4.2581 4.2409 1.0069 1.0270 1.0090 1.0041 1.0037 1.0060 0.9997 1.0084 1.0076 1.0070 1.0003 1.0068 1.0084 1.0013 1.0068 1.0030 1.0083 1.0185 1.0089 1.0181 1.0088 1.0086 1.0119 1.0089 1.0115
dispcorr: -0.027271954 hartree
energy: -1094.876602357152
dipole: 2.72050 -4.05955 -1.33906 13.59340 -12.81397 0.77943 12.50923 -11.25073 1.25850
magnitude: 1.99610 au
magnitude: 5.07367 debye
