program: Gaussian 09
title: 000062342
version: EM64L-G09RevD.01
frameworkgroup: C1[X(C16H18O)]
method: RPBEPBE
basis: SDD
operation: Freq
keyword: #pfreq=noraman
keyword: PBEPBE/SDD
title: #p freq=noraman PBEPBE/SDD
converged: YES YES NO NO
title: Mulliken charges:
elementType: O C C C C C C C C C C C C C C C C H H H H H H H H H H H H H H H H H H
charge: -0.313641 -0.129802 -0.095451 0.439253 0.434277 -0.714402 -0.705809 -0.440928 -0.401397 -0.361211 -0.420915 -0.217818 -0.222113 -0.234117 -0.228168 -0.242903 -0.244277 0.185071 0.211713 0.218074 0.233328 0.230575 0.235871 0.227882 0.209275 0.230379 0.272093 0.263720 0.229825 0.225129 0.222666 0.227102 0.223082 0.228102 0.225538
chargesum: 0.00000
title: Mulliken charges with hydrogens summed into heavy atoms:
elementType: O C C C C C C C C C C C C C C C C
charge: -0.313641 0.055269 0.116261 0.439253 0.434277 -0.032425 -0.032781 -0.210549 -0.129304 -0.097491 -0.191091 0.007311 0.000553 -0.007015 -0.005086 -0.014801 -0.018739
polarizability: 1.94917974e+02 -4.71809681e+00 1.64251623e+02 -2.70067244e+01 -3.59976398e+00 1.42053134e+02
1716.lowfreq: -12.8112 -2.1636 -0.0008 -0.0005 0.0007 6.7349 14.4429 21.0147 35.0298
frequency: 11.8053 20.6914 34.8269 53.4299 92.1465 138.5097 149.2346 183.7461 199.7523 211.4920 223.3339 260.0136 297.9988 332.9422 394.3650 400.1293 402.6321 404.9212 517.3384 528.0483 546.2251 588.7361 612.5514 616.2571 622.8507 704.9941 708.3467 757.5812 762.5702 770.5204 774.7576 821.8039 855.5872 859.6075 919.8984 925.6941 932.2908 978.1098 980.8680 984.7070 988.9925 990.1597 995.2176 999.6427 1005.4805 1024.5092 1025.7224 1057.5543 1067.8549 1075.4925 1078.0593 1095.9765 1121.5623 1170.7568 1171.2938 1181.4559 1183.4728 1207.6070 1214.6422 1288.5025 1292.4773 1301.8143 1319.0932 1338.9632 1348.8105 1379.1097 1384.8085 1385.5049 1389.4426 1437.1789 1440.5585 1458.7016 1463.9491 1465.7988 1470.8062 1481.5568 1484.3434 1593.2657 1594.1430 1612.1225 1615.1871 2943.0370 2959.5562 2982.5560 2992.7014 3076.1358 3094.0267 3096.3030 3098.2706 3108.9809 3109.9326 3123.7130 3124.0405 3135.1991 3137.5709 3146.4747 3156.0800 3162.3121 3171.0302
redmass: 3.8522 4.3301 3.8355 3.7351 3.8294 3.6158 3.1002 1.9324 1.5107 2.1075 1.3269 3.0603 3.5734 4.0312 3.6763 4.1017 2.9418 3.0398 3.4040 3.3279 3.0675 3.8610 5.3552 6.3647 4.5218 1.7736 1.7400 3.2973 2.1417 1.8394 2.4162 2.6297 1.2504 1.2491 1.4404 1.4505 2.2525 1.3782 1.6090 2.0480 5.5465 5.2497 1.3118 1.3409 2.3143 2.1834 2.1726 1.9017 1.7068 1.9918 1.8976 1.8697 2.2595 1.0527 1.0564 1.1154 1.1119 2.2550 2.0024 1.2640 1.5644 1.4364 1.2801 1.3724 1.4816 1.2536 1.9419 4.0618 2.2808 2.1444 2.1055 1.0587 1.0856 1.0677 1.1055 2.0547 2.1777 6.1935 6.0798 6.0905 6.1231 1.0833 1.0836 1.0356 1.0349 1.0992 1.1005 1.0999 1.1008 1.0877 1.0873 1.0867 1.0858 1.0910 1.0930 1.0958 1.0979 1.1014 1.0968
irintensity: 0.0831 0.1487 0.2271 1.2328 1.0340 2.6480 0.0525 1.6375 0.5636 0.4753 0.3849 0.1642 0.7593 1.5626 5.1453 1.1207 0.1508 0.4936 0.7337 15.9788 25.5448 0.9881 3.4745 0.3581 5.8110 58.7525 51.2723 4.6244 32.3183 49.9010 7.5468 3.5097 0.2248 0.1110 1.6802 0.5551 39.2944 0.5528 5.5047 8.6252 3.6010 3.1766 1.5776 5.9443 38.8337 41.3081 9.2466 108.1230 33.1437 35.6304 11.5850 1.3976 0.4216 0.1630 0.2158 2.2148 1.7796 10.1472 9.6278 30.3305 13.6578 6.4264 2.0760 11.9502 3.4962 22.3006 8.0062 8.8825 9.5980 10.2852 13.5697 9.8616 3.3513 7.0712 5.1968 9.2960 18.3822 1.0036 0.9871 1.9640 6.3214 39.3510 19.7342 27.9352 20.9702 47.7379 15.8780 26.0132 34.4437 11.1281 10.7505 1.0799 0.0862 13.9820 33.9923 33.4819 33.8970 25.0531 8.4219
temp: 298.150 k
press: 1.00000 atm
elementType: 8 6 6 6 6 6 6 6 6 6 6 6 6 6 6 6 6 1 1 1 1 1 1 1 1 1 1 1 1 1 1 1 1 1 1
symmnumber: 1
zpe: 768007.5 jmol-1
zpe.correction: 0.292519 hartree
zpe.thermalcorrener: 0.308586 hartree
zpe.thermalcorrenthalpy: 0.309531 hartree
zpe.thermalcorrgfe: 0.246155 hartree
zpe.sumelectzpe: -694.482536 hartree
zpe.sumelectthermal: -694.466469 hartree
zpe.sumelectthermalent: -694.465524 hartree
zpe.sumelectthermalfe: -694.528900 hartree
dipole: -1.0277 -0.1307 1.0980
dipole: 1.5096
quadrupole: -96.1725 -96.2790 -97.6988
quadrupole: -2.1982 -4.6562 0.2385
quadrupole: 0.5442 0.4378 -0.9820 -2.1982 -4.6562 0.2385
hfenergy: -694.7750551 hartree
pointgroup: C01 [X(C16H18O1)]
dipole: -0.3839501 -0.0301999 -0.4520992 debye
polarizability: 192.2851636|10.0728682|162.48348|27.9995313|-6.5471712|146.454087 unknown
InChI: InChI=1S/C16H18O/c1-13(15-9-5-3-6-10-15)17-14(2)16-11-7-4-8-12-16/h3-14H,1-2H3
charge 0 multiplicity 1
35 atoms
O  0.04312 -1.361304 0.537095
C  -1.393599 -1.650762 0.350196
C  0.747481 -0.889031 -0.67651
C  -2.196582 -0.386339 0.036562
C  2.017598 -0.177537 -0.221104
C  -1.839951 -2.311668 1.665406
C  1.069217 -2.076663 -1.615114
C  -3.261485 -0.421944 -0.896351
C  2.621895 -0.476491 1.024672
C  -1.911063 0.829273 0.709207
C  2.633732 0.770825 -1.075569
C  -4.039925 0.732109 -1.146324
C  3.824853 0.160981 1.405462
C  -2.682284 1.984506 0.456884
C  3.837022 1.406856 -0.696888
C  -3.75232 1.939152 -0.468846
C  4.438565 1.102123 0.546595
H  -1.524676 -2.37581 -0.483068
H  0.098565 -0.162268 -1.210367
H  -2.912597 -2.570044 1.624296
H  -1.680075 -1.619084 2.510045
H  -1.254586 -3.229496 1.847313
H  1.698975 -2.813423 -1.08674
H  1.619833 -1.724709 -2.506106
H  0.147671 -2.579761 -1.961216
H  -3.483994 -1.355245 -1.430308
H  2.13192 -1.193917 1.689382
H  -1.06949 0.861578 1.411003
H  2.167423 1.020826 -2.037459
H  -4.862053 0.691364 -1.870001
H  4.28205 -0.075049 2.373458
H  -2.449336 2.920138 0.977988
H  4.299967 2.141703 -1.365495
H  -4.35088 2.836206 -0.663835
H  5.370507 1.596303 0.843939
