program: Orca
programVersion: 5.0.2
elementType: O O O O N C C C C C C C C C C C C C C C C C C C H H H H H H H H H H H H H H H H H H H H H H H H H
charge: 0
multiplicity: 1
keywords: wb97x-d3
keywords: def2-TZVPP
keywords: def2/J RIJCOSX
keywords: DEFGRID2
keywords: scfconv7
keywords: smallprint printgap noloewdin
keywords: NOSOSCF
formula: C19H25NO4
InChI: InChI=1/C19H25NO4/c1-11(2)9-14-15(19(14,3)4)18(23)24-10-20-16(21)12-7-5-6-8-13(12)17(20)22/h9,14-15H,5-8,10H2,1-4H3
49 atoms
O  -0.597505 1.337842 1.525423
O  -0.212154 -0.855057 1.290646
O  2.777738 -0.511499 2.095344
O  1.088993 2.815257 -0.501757
N  1.726192 1.294438 1.109432
C  -2.257348 -0.036261 -1.097747
C  -2.756263 -1.139877 -0.221928
C  -2.22115 0.11634 0.417389
C  -0.974332 -0.244869 -1.865403
C  -3.244297 0.851824 -1.813095
C  -4.197776 -1.486747 -0.116542
C  -0.926486 0.103627 1.117307
C  -4.760461 -2.068102 0.94587
C  0.696909 1.554406 2.070312
C  -6.213437 -2.43168 0.963079
C  -4.00359 -2.404115 2.193455
C  3.229099 0.124513 -0.192358
C  2.750552 1.112616 -0.949164
C  4.224606 -0.88202 -0.632895
C  3.14444 1.382615 -2.352547
C  4.344842 -0.843112 -2.157761
C  4.406544 0.587348 -2.691155
C  2.587518 0.199531 1.141867
C  1.759951 1.875157 -0.153243
H  -2.078803 -1.98741 -0.150183
H  -2.942636 0.820256 0.8185
H  -0.275636 -0.909723 -1.359348
H  -1.195677 -0.689457 -2.837596
H  -0.466768 0.704761 -2.048172
H  -2.797584 1.82569 -2.020874
H  -3.536995 0.412889 -2.768864
H  -4.150517 1.023388 -1.23259
H  -4.819976 -1.279083 -0.982586
H  0.875849 0.938897 2.95106
H  0.703783 2.599536 2.366838
H  -6.345195 -3.505889 1.116086
H  -6.731656 -1.937659 1.789002
H  -6.717417 -2.158989 0.036028
H  -4.442205 -1.897417 3.057048
H  -4.063613 -3.474877 2.40443
H  -2.950562 -2.131508 2.146278
H  5.189175 -0.670124 -0.161271
H  3.933378 -1.877506 -0.290643
H  2.31863 1.102977 -3.014729
H  3.304104 2.452262 -2.505385
H  5.232882 -1.395671 -2.466547
H  3.486059 -1.357348 -2.598258
H  4.550796 0.577321 -3.771743
H  5.275704 1.094554 -2.263963
elementType: O N C H
totalener: -1094.86713948 hartree
nucrepener: 2161.79149451 hartree
electener: -3256.65863399 hartree
oneelecener: -5786.15352647 hartree
twoeener: 2529.49489248 hartree
cpcmener: -0.03833458 hartree
kineticenergy: 1090.04500605 hartree
xcener: -105.974399889351 hartree
chargesum: -0.0000000
charge: -0.280914 -0.478283 -0.426545 -0.432842 -0.105600 0.176630 -0.032339 -0.122738 -0.279667 -0.295913 -0.292774 0.412678 -0.019133 0.085141 -0.230063 -0.240620 -0.019394 -0.108164 -0.073704 -0.063117 -0.134154 -0.138472 0.310223 0.326284 0.104070 0.100997 0.091330 0.107409 0.090007 0.099564 0.100745 0.093703 0.126536 0.135395 0.144966 0.095856 0.094788 0.090431 0.097468 0.100362 0.076075 0.102079 0.093202 0.102256 0.095810 0.081088 0.078926 0.081522 0.078896
qa: -0.2809 -0.4783 -0.4265 -0.4328 -0.1056 0.1766 -0.0323 -0.1227 -0.2797 -0.2959 -0.2928 0.4127 -0.0191 0.0851 -0.2301 -0.2406 -0.0194 -0.1082 -0.0737 -0.0631 -0.1342 -0.1385 0.3102 0.3263 0.1041 0.1010 0.0913 0.1074 0.0900 0.0996 0.1007 0.0937 0.1265 0.1354 0.1450 0.0959 0.0948 0.0904 0.0975 0.1004 0.0761 0.1021 0.0932 0.1023 0.0958 0.0811 0.0789 0.0815 0.0789
va: 2.1144 2.0153 2.0815 2.0673 3.0802 3.7071 3.8465 3.8124 3.8832 3.9037 3.8832 4.1511 3.7110 3.8936 3.9288 3.9343 3.6118 3.7193 3.9110 3.9116 3.9145 3.9219 4.1923 4.1575 1.0231 1.0292 1.0120 1.0019 1.0094 1.0031 0.9987 1.0009 1.0015 1.0138 0.9927 0.9958 0.9963 1.0062 0.9986 0.9993 1.0219 1.0038 1.0157 1.0064 1.0157 1.0094 1.0075 1.0093 1.0059
dispcorr: -0.025959254 hartree
energy: -1094.893098738563
dipole: -17.53102 17.72352 0.19250 -11.46623 11.66753 0.20130 -13.38878 11.98378 -1.40500
magnitude: 1.43234 au
magnitude: 3.64073 debye
