program: Orca
programVersion: 5.0.2
elementType: O O O O N C C C C C C C C C C C C C C C C C C C H H H H H H H H H H H H H H H H H H H H H H H H H
charge: 0
multiplicity: 1
keywords: wb97x-d3
keywords: def2-TZVPP
keywords: def2/J RIJCOSX
keywords: DEFGRID2
keywords: scfconv7
keywords: smallprint printgap noloewdin
keywords: NOSOSCF
formula: C19H25NO4
InChI: InChI=1/C19H25NO4/c1-11(2)9-14-15(19(14,3)4)18(23)24-10-20-16(21)12-7-5-6-8-13(12)17(20)22/h9,14-15H,5-8,10H2,1-4H3
49 atoms
O  -0.588832 1.116225 0.732901
O  -1.844092 2.595169 1.827326
O  2.236883 2.472789 -0.779241
O  1.590935 -1.077558 1.978364
N  1.694195 0.929166 0.84746
C  -2.943501 0.857045 -1.209921
C  -2.941799 -0.280645 -0.237575
C  -2.901917 1.15363 0.279678
C  -1.72808 1.058377 -2.083311
C  -4.223825 1.254868 -1.906266
C  -4.123132 -1.114366 0.048684
C  -1.750968 1.699631 1.014957
C  -4.077723 -2.391429 0.441085
C  0.570847 1.580021 1.422516
C  -5.334266 -3.166035 0.695251
C  -2.791001 -3.14763 0.643826
C  3.38314 0.347521 -0.607457
C  3.18336 -0.702297 0.191093
C  4.422569 0.433561 -1.661436
C  3.941277 -1.975147 0.134416
C  5.436608 -0.695168 -1.466616
C  4.756605 -2.028447 -1.159349
C  2.406655 1.403395 -0.25021
C  2.080863 -0.37776 1.128032
H  -1.99231 -0.801124 -0.176878
H  -3.836307 1.528703 0.681994
H  -1.55329 2.118355 -2.276725
H  -0.817542 0.633969 -1.667495
H  -1.897685 0.57464 -3.047171
H  -4.407268 0.611502 -2.768731
H  -5.097293 1.2025 -1.25794
H  -4.149986 2.281212 -2.270353
H  -5.095726 -0.64547 -0.064263
H  0.505991 1.332553 2.481401
H  0.688555 2.657145 1.314787
H  -5.380924 -4.055824 0.061789
H  -5.370841 -3.52354 1.727639
H  -6.229826 -2.573163 0.510207
H  -2.306785 -3.384935 -0.30628
H  -2.06807 -2.589351 1.240229
H  -2.970084 -4.093969 1.153969
H  3.948711 0.366321 -2.645607
H  4.913411 1.408859 -1.628229
H  4.593828 -2.046508 1.009962
H  3.257323 -2.824677 0.198173
H  6.053321 -0.788496 -2.361043
H  6.11051 -0.434028 -0.646202
H  5.503441 -2.819505 -1.08541
H  4.096678 -2.296336 -1.988825
elementType: O N C H
totalener: -1094.86784183 hartree
nucrepener: 2102.11934144 hartree
electener: -3196.98718327 hartree
oneelecener: -5665.85294760 hartree
twoeener: 2468.86576433 hartree
cpcmener: -0.03848358 hartree
kineticenergy: 1090.03621492 hartree
xcener: -105.972581882142 hartree
chargesum: 0.0000000
charge: -0.271600 -0.499161 -0.434515 -0.437169 -0.110143 0.101768 0.058737 -0.093147 -0.273246 -0.283653 -0.319260 0.427631 -0.002062 0.073470 -0.226694 -0.289525 -0.058201 -0.061455 -0.073524 -0.068100 -0.134575 -0.137261 0.326385 0.335068 0.102606 0.089142 0.101895 0.085982 0.096532 0.098512 0.092056 0.098379 0.119259 0.140318 0.127532 0.099222 0.095518 0.085853 0.107999 0.098610 0.096950 0.102802 0.094326 0.101965 0.094513 0.080802 0.078878 0.080955 0.079626
qa: -0.2716 -0.4992 -0.4345 -0.4372 -0.1101 0.1018 0.0587 -0.0931 -0.2732 -0.2837 -0.3193 0.4276 -0.0021 0.0735 -0.2267 -0.2895 -0.0582 -0.0615 -0.0735 -0.0681 -0.1346 -0.1373 0.3264 0.3351 0.1026 0.0891 0.1019 0.0860 0.0965 0.0985 0.0921 0.0984 0.1193 0.1403 0.1275 0.0992 0.0955 0.0859 0.1080 0.0986 0.0969 0.1028 0.0943 0.1020 0.0945 0.0808 0.0789 0.0810 0.0796
va: 2.1036 1.9990 2.0725 2.0674 3.1466 3.6986 3.7479 3.8481 3.9099 3.9181 3.9097 4.1271 3.6935 3.9007 3.9239 3.9436 3.6906 3.6995 3.9187 3.9159 3.9162 3.9175 4.1690 4.1712 1.0126 1.0316 1.0002 1.0118 1.0004 1.0006 1.0069 1.0006 1.0117 0.9991 1.0079 0.9924 0.9933 1.0098 0.9941 1.0005 1.0036 1.0048 1.0149 1.0046 1.0147 1.0096 1.0066 1.0094 1.0062
dispcorr: -0.023051467 hartree
energy: -1094.890893299141
dipole: -12.69401 14.19875 1.50474 -17.18850 15.26056 -1.92794 -13.11356 11.47365 -1.63990
magnitude: 2.94457 au
magnitude: 7.48449 debye
