program: Orca
programVersion: 5.0.2
elementType: O O O O N C C C C C C C C C C C C C C C C C C C H H H H H H H H H H H H H H H H H H H H H H H H H
charge: 0
multiplicity: 1
keywords: wb97x-d3
keywords: def2-TZVPP
keywords: def2/J RIJCOSX
keywords: DEFGRID2
keywords: scfconv7
keywords: smallprint printgap noloewdin
keywords: NOSOSCF
formula: C19H25NO4
InChI: InChI=1/C19H25NO4/c1-11(2)9-14-15(19(14,3)4)18(23)24-10-20-16(21)12-7-5-6-8-13(12)17(20)22/h9,14-15H,5-8,10H2,1-4H3
49 atoms
O  -0.530792 1.144692 0.877721
O  -1.766927 2.756502 1.792136
O  1.731826 1.746852 -1.440058
O  2.272037 -0.123121 2.666427
N  1.761737 1.088949 0.769507
C  -3.10944 0.883271 -0.886121
C  -2.839682 -0.326797 -0.041379
C  -2.872422 1.031083 0.611235
C  -2.064532 1.321522 -1.881929
C  -4.518768 1.149674 -1.352297
C  -3.904247 -1.311699 0.278636
C  -1.692681 1.72998 1.15153
C  -4.098685 -2.455339 -0.383737
C  0.658934 1.845618 1.245816
C  -5.183823 -3.410936 0.007854
C  -3.266021 -2.882338 -1.553709
C  3.258382 0.047717 -0.638631
C  3.42673 -0.490386 0.57049
C  4.02687 -0.318888 -1.852377
C  4.43548 -1.522522 0.911293
C  4.797489 -1.615045 -1.595216
C  5.461526 -1.621091 -0.219042
C  2.181564 1.061557 -0.555693
C  2.451949 0.127229 1.501495
H  -1.849342 -0.749121 -0.180475
H  -3.767856 1.268354 1.176344
H  -2.286433 0.881811 -2.856233
H  -2.066361 2.406256 -2.006304
H  -1.056188 1.013198 -1.61519
H  -4.735664 0.575062 -2.255452
H  -5.265955 0.885523 -0.604692
H  -4.648775 2.205973 -1.594619
H  -4.565932 -1.072669 1.106208
H  0.733343 1.944839 2.327822
H  0.671432 2.83749 0.795142
H  -4.772488 -4.394905 0.24729
H  -5.747792 -3.06215 0.872623
H  -5.885654 -3.562982 -0.816059
H  -2.554482 -2.124344 -1.877334
H  -2.705939 -3.791996 -1.321058
H  -3.903114 -3.125331 -2.407594
H  3.356479 -0.42526 -2.708145
H  4.711636 0.496742 -2.104807
H  4.920867 -1.279664 1.859224
H  3.934091 -2.483058 1.065985
H  4.110653 -2.462645 -1.668755
H  5.548562 -1.751822 -2.373855
H  6.154563 -0.778101 -0.149395
H  6.055886 -2.526704 -0.093595
elementType: O N C H
totalener: -1094.86821380 hartree
nucrepener: 2094.14909859 hartree
electener: -3189.01731239 hartree
oneelecener: -5649.94726243 hartree
twoeener: 2460.92995004 hartree
cpcmener: -0.03790936 hartree
kineticenergy: 1090.03906695 hartree
xcener: -105.972247133618 hartree
chargesum: -0.0000000
charge: -0.270147 -0.495295 -0.436262 -0.431922 -0.107291 0.137477 0.028891 -0.137289 -0.291556 -0.273077 -0.291927 0.431338 -0.028495 0.070769 -0.230319 -0.253852 -0.047815 -0.075514 -0.073772 -0.073190 -0.135168 -0.135386 0.325336 0.340609 0.106541 0.096437 0.098262 0.107317 0.079087 0.095835 0.092264 0.100612 0.124308 0.131982 0.141015 0.094603 0.090566 0.095158 0.087363 0.102491 0.095877 0.094579 0.102666 0.094294 0.103200 0.078795 0.080893 0.079089 0.080624
qa: -0.2701 -0.4953 -0.4363 -0.4319 -0.1073 0.1375 0.0289 -0.1373 -0.2916 -0.2731 -0.2919 0.4313 -0.0285 0.0708 -0.2303 -0.2539 -0.0478 -0.0755 -0.0738 -0.0732 -0.1352 -0.1354 0.3253 0.3406 0.1065 0.0964 0.0983 0.1073 0.0791 0.0958 0.0923 0.1006 0.1243 0.1320 0.1410 0.0946 0.0906 0.0952 0.0874 0.1025 0.0959 0.0946 0.1027 0.0943 0.1032 0.0788 0.0809 0.0791 0.0806
va: 2.1075 2.0006 2.0682 2.0797 3.1404 3.6683 3.7570 3.9312 3.9142 3.9098 3.8551 4.1328 3.7024 3.8901 3.9276 3.9423 3.6984 3.7024 3.9190 3.9170 3.9163 3.9156 4.1726 4.1821 1.0137 1.0327 1.0025 0.9994 1.0126 1.0017 1.0023 1.0024 1.0073 1.0064 0.9992 0.9950 1.0072 0.9962 1.0075 0.9977 0.9982 1.0150 1.0044 1.0151 1.0048 1.0065 1.0093 1.0065 1.0096
dispcorr: -0.023632257 hartree
energy: -1094.891846059373
dipole: -14.75513 16.12789 1.37276 -18.03948 15.99150 -2.04798 -16.02759 14.35214 -1.67546
magnitude: 2.98092 au
magnitude: 7.57690 debye
