program: Orca
programVersion: 5.0.2
elementType: O O O O N C C C C C C C C C C C C C C C C C C C H H H H H H H H H H H H H H H H H H H H H H H H H
charge: 0
multiplicity: 1
keywords: wb97x-d3
keywords: def2-TZVPP
keywords: def2/J RIJCOSX
keywords: DEFGRID2
keywords: scfconv7
keywords: smallprint printgap noloewdin
keywords: NOSOSCF
formula: C19H25NO4
InChI: InChI=1/C19H25NO4/c1-11(2)9-14-15(19(14,3)4)18(23)24-10-20-16(21)12-7-5-6-8-13(12)17(20)22/h9,14-15H,5-8,10H2,1-4H3
49 atoms
O  -0.637877 0.884377 1.329635
O  -1.366185 2.948344 0.845892
O  1.631519 2.422824 -0.540329
O  2.127549 -1.058282 2.331053
N  1.686186 0.893323 1.182932
C  -2.317355 0.311855 -1.274918
C  -2.839176 -0.380076 -0.04829
C  -2.571343 1.10797 -0.003687
C  -0.906203 0.007412 -1.717337
C  -3.244924 0.602247 -2.429643
C  -4.235929 -0.851948 0.059849
C  -1.480973 1.748225 0.754222
C  -4.634642 -2.078224 0.413363
C  0.563467 1.360468 1.92689
C  -6.092967 -2.414905 0.500388
C  -3.715613 -3.212335 0.751821
C  3.094901 0.493968 -0.597509
C  3.238257 -0.530268 0.245511
C  3.85012 0.670429 -1.860911
C  4.165797 -1.671021 0.053646
C  5.048232 -0.280629 -1.873748
C  4.673658 -1.680163 -1.389249
C  2.071229 1.413551 -0.048271
C  2.316083 -0.330616 1.38886
H  -2.100622 -0.995105 0.452876
H  -3.444504 1.749711 -0.058765
H  -0.43679 0.88392 -2.168419
H  -0.267142 -0.346455 -0.910157
H  -0.926527 -0.776685 -2.476566
H  -2.849907 1.417864 -3.037974
H  -3.338265 -0.274209 -3.073774
H  -4.245649 0.888105 -2.108651
H  -5.004888 -0.119206 -0.168224
H  0.612803 0.954779 2.933926
H  0.58343 2.445638 1.984912
H  -6.727982 -1.558701 0.273928
H  -6.352395 -3.221171 -0.190375
H  -6.35242 -2.772145 1.500446
H  -2.661407 -2.983184 0.609771
H  -3.854052 -3.524223 1.790068
H  -3.949245 -4.084657 0.136706
H  3.186743 0.469665 -2.708141
H  4.172797 1.708262 -1.968701
H  4.998639 -1.576198 0.757478
H  3.668776 -2.612146 0.299329
H  5.460956 -0.332241 -2.881827
H  5.835209 0.125632 -1.232375
H  5.534127 -2.345492 -1.467359
H  3.897849 -2.092208 -2.040364
elementType: O N C H
totalener: -1094.86848994 hartree
nucrepener: 2129.61919652 hartree
electener: -3224.48768646 hartree
oneelecener: -5721.01737992 hartree
twoeener: 2496.52969346 hartree
cpcmener: -0.04165646 hartree
kineticenergy: 1090.03504113 hartree
xcener: -105.973519097249 hartree
chargesum: 0.0000000
charge: -0.274782 -0.480428 -0.428738 -0.433551 -0.084989 0.114371 0.077568 -0.142111 -0.274734 -0.273327 -0.308042 0.434364 -0.040909 0.061128 -0.222019 -0.254841 -0.016394 -0.076230 -0.071922 -0.066188 -0.134254 -0.138002 0.264759 0.346376 0.099210 0.094349 0.098886 0.079452 0.102040 0.099427 0.096458 0.089525 0.121864 0.128957 0.139958 0.088739 0.094431 0.093158 0.090273 0.098280 0.094941 0.102411 0.095218 0.101734 0.093345 0.080938 0.078663 0.080996 0.079641
qa: -0.2748 -0.4804 -0.4287 -0.4336 -0.0850 0.1144 0.0776 -0.1421 -0.2747 -0.2733 -0.3080 0.4344 -0.0409 0.0611 -0.2220 -0.2548 -0.0164 -0.0762 -0.0719 -0.0662 -0.1343 -0.1380 0.2648 0.3464 0.0992 0.0943 0.0989 0.0795 0.1020 0.0994 0.0965 0.0895 0.1219 0.1290 0.1400 0.0887 0.0944 0.0932 0.0903 0.0983 0.0949 0.1024 0.0952 0.1017 0.0933 0.0809 0.0787 0.0810 0.0796
va: 2.1104 2.0191 2.0716 2.0763 3.1004 3.6991 3.7172 3.8592 3.9061 3.9065 3.8597 4.1566 3.7521 3.8883 3.9225 3.9427 3.6062 3.7150 3.9169 3.9155 3.9168 3.9190 4.2045 4.1723 1.0246 1.0335 1.0058 1.0123 1.0023 1.0012 1.0022 1.0052 1.0098 1.0121 1.0180 1.0086 0.9963 0.9957 1.0097 0.9964 0.9976 1.0054 1.0154 1.0045 1.0159 1.0094 1.0064 1.0094 1.0065
dispcorr: -0.024676095 hartree
energy: -1094.893166038087
dipole: -13.68026 14.88958 1.20932 -18.27719 16.13234 -2.14485 -14.87659 13.66828 -1.20831
magnitude: 2.74278 au
magnitude: 6.97160 debye
