program: Orca
programVersion: 5.0.2
elementType: O O O O N C C C C C C C C C C C C C C C C C C C H H H H H H H H H H H H H H H H H H H H H H H H H
charge: 0
multiplicity: 1
keywords: wb97x-d3
keywords: def2-TZVPP
keywords: def2/J RIJCOSX
keywords: DEFGRID2
keywords: scfconv7
keywords: smallprint printgap noloewdin
keywords: NOSOSCF
formula: C19H25NO4
InChI: InChI=1/C19H25NO4/c1-11(2)9-14-15(19(14,3)4)18(23)24-10-20-16(21)12-7-5-6-8-13(12)17(20)22/h9,14-15H,5-8,10H2,1-4H3
49 atoms
O  -0.663161 1.079902 1.22749
O  -1.572977 2.980324 0.462708
O  2.17085 -0.607453 2.230684
O  1.454835 2.533279 -0.965928
N  1.6400 1.211475 0.913996
C  -2.400437 -0.01091 -1.1634
C  -2.780145 -0.555771 0.184181
C  -2.663494 0.940115 -0.00705
C  -0.989848 -0.235553 -1.652962
C  -3.413553 0.011365 -2.280481
C  -4.111611 -1.132499 0.461452
C  -1.594135 1.776196 0.567285
C  -4.365308 -2.28908 1.083305
C  0.533401 1.71998 1.655888
C  -5.776329 -2.743669 1.307901
C  -3.323475 -3.230855 1.604644
C  3.184022 -0.273124 0.059175
C  2.980001 0.654044 -0.878477
C  4.130761 -1.408899 -0.052989
C  3.682747 0.715603 -2.18269
C  4.586686 -1.552891 -1.50629
C  4.907397 -0.200518 -2.141184
C  2.305962 0.02608 1.214412
C  1.952356 1.601162 -0.385139
H  -1.954879 -1.015327 0.715065
H  -3.597228 1.48603 -0.090992
H  -0.279877 -0.416021 -0.848067
H  -0.965686 -1.111833 -2.303016
H  -0.635596 0.614101 -2.239097
H  -3.13591 0.755212 -3.029171
H  -3.453283 -0.959048 -2.778789
H  -4.418886 0.251433 -1.937451
H  -4.962124 -0.544772 0.128015
H  0.671425 1.483213 2.707655
H  0.47945 2.799941 1.543129
H  -6.505806 -2.038377 0.910837
H  -5.954904 -3.714609 0.838931
H  -5.97997 -2.875957 2.373645
H  -2.301657 -2.900137 1.433028
H  -3.450058 -3.388208 2.677825
H  -3.433772 -4.212894 1.139511
H  4.985631 -1.22871 0.606274
H  3.664188 -2.329698 0.304169
H  2.995771 0.410213 -2.978195
H  3.970939 1.743947 -2.410914
H  5.460581 -2.203568 -1.550526
H  3.798808 -2.0446 -2.083054
H  5.290884 -0.343007 -3.151898
H  5.700999 0.288478 -1.569512
elementType: O N C H
totalener: -1094.86879772 hartree
nucrepener: 2134.62423316 hartree
electener: -3229.49303087 hartree
oneelecener: -5731.00041422 hartree
twoeener: 2501.50738335 hartree
cpcmener: -0.04184703 hartree
kineticenergy: 1090.04529157 hartree
xcener: -105.975633335622 hartree
chargesum: -0.0000000
charge: -0.274072 -0.479341 -0.433716 -0.428370 -0.087107 0.106886 0.076288 -0.128800 -0.268094 -0.274647 -0.304765 0.429758 -0.048652 0.061747 -0.221149 -0.252094 -0.071193 -0.020842 -0.066744 -0.072240 -0.137706 -0.134299 0.344910 0.267460 0.100272 0.094562 0.074171 0.101323 0.099926 0.098390 0.096765 0.089057 0.122349 0.130561 0.137676 0.088816 0.093985 0.093811 0.088934 0.096291 0.096544 0.101354 0.093753 0.102628 0.095273 0.080997 0.079277 0.081458 0.078614
qa: -0.2741 -0.4793 -0.4337 -0.4284 -0.0871 0.1069 0.0763 -0.1288 -0.2681 -0.2746 -0.3048 0.4298 -0.0487 0.0617 -0.2211 -0.2521 -0.0712 -0.0208 -0.0667 -0.0722 -0.1377 -0.1343 0.3449 0.2675 0.1003 0.0946 0.0742 0.1013 0.0999 0.0984 0.0968 0.0891 0.1223 0.1306 0.1377 0.0888 0.0940 0.0938 0.0889 0.0963 0.0965 0.1014 0.0938 0.1026 0.0953 0.0810 0.0793 0.0815 0.0786
va: 2.1107 2.0212 2.0741 2.0712 3.1025 3.7011 3.7159 3.8446 3.9047 3.9075 3.8535 4.1629 3.7639 3.8933 3.9215 3.9418 3.7102 3.6038 3.9162 3.9164 3.9184 3.9156 4.1681 4.2023 1.0231 1.0321 1.0137 1.0023 1.0053 1.0012 1.0018 1.0060 1.0102 1.0092 1.0199 1.0087 0.9962 0.9960 1.0112 0.9967 0.9972 1.0047 1.0157 1.0056 1.0154 1.0093 1.0068 1.0094 1.0065
dispcorr: -0.024795374 hartree
energy: -1094.893593090161
dipole: -12.63154 13.95787 1.32632 -21.25778 19.05022 -2.20756 -10.75613 9.81280 -0.94333
magnitude: 2.74269 au
magnitude: 6.97136 debye
