program: Orca
programVersion: 5.0.2
elementType: O O O O N C C C C C C C C C C C C C C C C C C C H H H H H H H H H H H H H H H H H H H H H H H H H
charge: 0
multiplicity: 1
keywords: wb97x-d3
keywords: def2-TZVPP
keywords: def2/J RIJCOSX
keywords: DEFGRID2
keywords: scfconv7
keywords: smallprint printgap noloewdin
keywords: NOSOSCF
formula: C19H25NO4
InChI: InChI=1/C19H25NO4/c1-11(2)9-14-15(19(14,3)4)18(23)24-10-20-16(21)12-7-5-6-8-13(12)17(20)22/h9,14-15H,5-8,10H2,1-4H3
49 atoms
O  -0.642384 0.861069 1.337263
O  -1.346361 2.933637 0.850901
O  1.613582 2.447531 -0.493226
O  2.136442 -1.098292 2.293071
N  1.682784 0.880023 1.19548
C  -2.260444 0.249088 -1.268202
C  -2.859123 -0.374353 -0.041223
C  -2.539219 1.105616 -0.04163
C  -0.844101 -0.121733 -1.640331
C  -3.128191 0.526856 -2.471691
C  -4.276076 -0.787161 0.028041
C  -1.464689 1.734719 0.745168
C  -4.740552 -1.967991 0.449876
C  0.556235 1.321087 1.950786
C  -6.213971 -2.243447 0.483951
C  -3.88657 -3.105993 0.920605
C  3.095644 0.535197 -0.593485
C  3.249027 -0.506768 0.225706
C  3.845119 0.745622 -1.855232
C  4.187415 -1.6340 0.006702
C  5.050147 -0.195956 -1.89388
C  4.686346 -1.6085 -1.439164
C  2.063437 1.43202 -0.023306
C  2.322464 -0.343816 1.371625
H  -2.165652 -0.992612 0.51679
H  -3.386807 1.772715 -0.157847
H  -0.257994 -0.488572 -0.799604
H  -0.864202 -0.91752 -2.387253
H  -0.3169 0.725444 -2.083186
H  -4.126959 0.869424 -2.205131
H  -2.673838 1.295778 -3.098985
H  -3.234975 -0.373708 -3.07947
H  -5.002921 -0.046339 -0.292969
H  0.604291 0.883469 2.944201
H  0.573505 2.403856 2.043504
H  -6.801323 -1.386337 0.155228
H  -6.469533 -3.093753 -0.153449
H  -6.538821 -2.50763 1.493718
H  -4.121014 -4.014177 0.360943
H  -2.818512 -2.926759 0.82149
H  -4.09031 -3.333942 1.970119
H  3.179231 0.557998 -2.703611
H  4.159463 1.787917 -1.942538
H  5.024239 -1.544082 0.706688
H  3.701927 -2.584991 0.237072
H  5.459657 -0.22181 -2.90414
H  5.836398 0.201158 -1.245955
H  5.549664 -2.267339 -1.537918
H  3.908145 -2.00969 -2.094376
elementType: O N C H
totalener: -1094.86858455 hartree
nucrepener: 2131.11055498 hartree
electener: -3225.97913953 hartree
oneelecener: -5724.01163944 hartree
twoeener: 2498.03249991 hartree
cpcmener: -0.04190560 hartree
kineticenergy: 1090.03326389 hartree
xcener: -105.973585389435 hartree
chargesum: 0.0000000
charge: -0.275347 -0.481065 -0.429263 -0.433509 -0.085028 0.112384 0.077826 -0.134413 -0.275446 -0.274750 -0.307847 0.432206 -0.043539 0.059996 -0.222050 -0.254319 -0.022170 -0.071096 -0.070294 -0.066311 -0.134634 -0.138040 0.269502 0.342216 0.100471 0.093074 0.080299 0.102509 0.098344 0.089786 0.099523 0.096614 0.122042 0.128851 0.140697 0.089333 0.094380 0.093134 0.095113 0.090112 0.098140 0.102298 0.095212 0.101652 0.093129 0.080952 0.078520 0.081198 0.079608
qa: -0.2753 -0.4811 -0.4293 -0.4335 -0.0850 0.1124 0.0778 -0.1344 -0.2754 -0.2747 -0.3078 0.4322 -0.0435 0.0600 -0.2220 -0.2543 -0.0222 -0.0711 -0.0703 -0.0663 -0.1346 -0.1380 0.2695 0.3422 0.1005 0.0931 0.0803 0.1025 0.0983 0.0898 0.0995 0.0966 0.1220 0.1289 0.1407 0.0893 0.0944 0.0931 0.0951 0.0901 0.0981 0.1023 0.0952 0.1017 0.0931 0.0810 0.0785 0.0812 0.0796
va: 2.1075 2.0182 2.0714 2.0763 3.0986 3.6928 3.7176 3.8504 3.9062 3.9085 3.8589 4.1584 3.7571 3.8907 3.9220 3.9427 3.6143 3.7104 3.9163 3.9152 3.9175 3.9184 4.1987 4.1711 1.0243 1.0339 1.0122 1.0020 1.0056 1.0056 1.0010 1.0019 1.0101 1.0126 1.0170 1.0086 0.9963 0.9959 0.9977 1.0101 0.9962 1.0057 1.0155 1.0044 1.0161 1.0094 1.0064 1.0094 1.0066
dispcorr: -0.024771418 hartree
energy: -1094.893355965828
dipole: -13.83590 15.03872 1.20282 -17.95105 15.82528 -2.12576 -14.69389 13.48488 -1.20901
magnitude: 2.72532 au
magnitude: 6.92720 debye
