program: Orca
programVersion: 5.0.2
elementType: O O O O N C C C C C C C C C C C C C C C C C C C H H H H H H H H H H H H H H H H H H H H H H H H H
charge: 0
multiplicity: 1
keywords: wb97x-d3
keywords: def2-TZVPP
keywords: def2/J RIJCOSX
keywords: DEFGRID2
keywords: scfconv7
keywords: smallprint printgap noloewdin
keywords: NOSOSCF
formula: C19H25NO4
InChI: InChI=1/C19H25NO4/c1-11(2)9-14-15(19(14,3)4)18(23)24-10-20-16(21)12-7-5-6-8-13(12)17(20)22/h9,14-15H,5-8,10H2,1-4H3
49 atoms
O  -0.169798 0.615133 0.022811
O  -1.792776 2.108835 -0.313172
O  2.473479 0.445264 -2.160916
O  2.318529 1.180018 2.320039
N  2.085599 1.056977 0.028573
C  -3.470508 -0.204434 1.07729
C  -3.783126 -0.113362 -0.385153
C  -2.341095 -0.196167 0.057111
C  -3.730831 0.999871 1.946351
C  -3.694776 -1.513552 1.791842
C  -4.368535 -1.242014 -1.146768
C  -1.452229 0.966631 -0.099945
C  -5.612544 -1.279495 -1.632923
C  0.804121 1.650666 -0.114752
C  -6.099302 -2.453156 -2.427089
C  -6.614108 -0.179888 -1.450031
C  4.026683 -0.111381 -0.38854
C  3.981791 0.106973 0.926755
C  5.12213 -0.813126 -1.100053
C  5.027007 -0.30156 1.895731
C  6.008813 -1.536687 -0.084952
C  6.303426 -0.668989 1.137488
C  2.807009 0.465133 -1.002936
C  2.728427 0.832194 1.241323
H  -4.094168 0.876016 -0.706198
H  -1.850763 -1.154621 -0.076182
H  -3.679744 1.94144 1.403749
H  -4.732333 0.92711 2.374586
H  -3.022962 1.047202 2.776239
H  -4.741533 -1.608987 2.086931
H  -3.443624 -2.376977 1.177023
H  -3.090107 -1.564388 2.698846
H  -3.722595 -2.097417 -1.322318
H  0.66976 2.410898 0.653596
H  0.732029 2.119678 -1.09535
H  -6.428434 -2.141781 -3.421986
H  -5.330479 -3.215522 -2.550409
H  -6.965155 -2.918526 -1.949142
H  -6.834896 0.308828 -2.403093
H  -7.561594 -0.584669 -1.086513
H  -6.292017 0.587327 -0.748036
H  4.714644 -1.513612 -1.832534
H  5.703402 -0.082773 -1.671749
H  5.214339 0.499431 2.614136
H  4.664323 -1.153537 2.479438
H  5.510513 -2.455585 0.235745
H  6.940698 -1.83676 -0.565016
H  6.806676 0.24745 0.817568
H  6.990192 -1.186609 1.807842
elementType: O N C H
totalener: -1094.87101804 hartree
nucrepener: 2025.90830489 hartree
electener: -3120.77932292 hartree
oneelecener: -5513.88923585 hartree
twoeener: 2393.10991293 hartree
cpcmener: -0.03708746 hartree
kineticenergy: 1090.04103445 hartree
xcener: -105.972486696223 hartree
chargesum: 0.0000000
charge: -0.277935 -0.496629 -0.433253 -0.433518 -0.114019 0.148423 0.015605 -0.130050 -0.291028 -0.264005 -0.286612 0.426216 -0.023827 0.087596 -0.227495 -0.257181 -0.072540 -0.068173 -0.068852 -0.073561 -0.135626 -0.134696 0.339637 0.339590 0.094240 0.093180 0.091522 0.097227 0.102402 0.096814 0.090890 0.099259 0.124364 0.134097 0.132748 0.094451 0.089371 0.094507 0.101018 0.094624 0.089351 0.093359 0.101888 0.093796 0.102609 0.078900 0.081323 0.078888 0.081104
qa: -0.2779 -0.4966 -0.4333 -0.4335 -0.1140 0.1484 0.0156 -0.1300 -0.2910 -0.2640 -0.2866 0.4262 -0.0238 0.0876 -0.2275 -0.2572 -0.0725 -0.0682 -0.0689 -0.0736 -0.1356 -0.1347 0.3396 0.3396 0.0942 0.0932 0.0915 0.0972 0.1024 0.0968 0.0909 0.0993 0.1244 0.1341 0.1327 0.0945 0.0894 0.0945 0.1010 0.0946 0.0894 0.0934 0.1019 0.0938 0.1026 0.0789 0.0813 0.0789 0.0811
va: 2.1144 2.0032 2.0780 2.0777 3.1380 3.6739 3.7592 3.9262 3.9046 3.9050 3.8813 4.1170 3.7002 3.8824 3.9268 3.9454 3.6914 3.6841 3.9192 3.9206 3.9173 3.9152 4.1864 4.1882 1.0272 1.0359 1.0169 1.0009 0.9992 1.0029 1.0029 1.0029 1.0071 1.0021 1.0019 0.9944 1.0082 0.9966 0.9965 0.9981 1.0066 1.0153 1.0044 1.0151 1.0046 1.0065 1.0092 1.0068 1.0095
dispcorr: -0.021841432 hartree
energy: -1094.892859468389
dipole: -22.18204 23.51975 1.33771 -14.08767 12.47113 -1.61654 1.38446 -0.93511 0.44935
magnitude: 2.14583 au
magnitude: 5.45426 debye
