program: Orca
programVersion: 5.0.2
elementType: O O O O N C C C C C C C C C C C C C C C C C C C H H H H H H H H H H H H H H H H H H H H H H H H H
charge: 0
multiplicity: 1
keywords: wb97x-d3
keywords: def2-TZVPP
keywords: def2/J RIJCOSX
keywords: DEFGRID2
keywords: scfconv7
keywords: smallprint printgap noloewdin
keywords: NOSOSCF
formula: C19H25NO4
InChI: InChI=1/C19H25NO4/c1-11(2)9-14-15(19(14,3)4)18(23)24-10-20-16(21)12-7-5-6-8-13(12)17(20)22/h9,14-15H,5-8,10H2,1-4H3
49 atoms
O  -0.515193 1.771924 1.407359
O  -0.358135 -0.457038 1.535588
O  1.494824 2.644549 -0.697666
O  2.539192 -0.315452 2.590455
N  1.812309 1.38852 1.208193
C  -2.287731 0.1685 -1.000339
C  -2.911025 -0.72225 0.04019
C  -2.249674 0.5577 0.46873
C  -1.024999 -0.288614 -1.687501
C  -3.182483 0.997402 -1.886041
C  -4.380855 -0.856818 0.178898
C  -0.96625 0.528734 1.193196
C  -5.095903 -1.935803 -0.152303
C  0.762808 1.942648 2.006579
C  -6.581149 -1.97108 0.042846
C  -4.507857 -3.180943 -0.740146
C  2.969424 0.724687 -0.672535
C  3.266499 -0.14803 0.2910
C  3.515126 0.694572 -2.050513
C  4.184431 -1.30273 0.141769
C  4.715818 -0.251329 -2.101152
C  4.450023 -1.5513 -1.344024
C  2.015814 1.718408 -0.126488
C  2.525511 0.232293 1.517387
H  -2.338206 -1.619891 0.251735
H  -2.896277 1.388056 0.734749
H  -0.405468 0.563782 -1.975806
H  -0.418661 -0.953696 -1.074219
H  -1.276714 -0.831829 -2.600281
H  -4.072539 1.352936 -1.368202
H  -2.647205 1.869818 -2.264982
H  -3.511563 0.412022 -2.74711
H  -4.909933 0.001649 0.582914
H  0.804814 1.496338 2.999434
H  0.881954 3.018485 2.10191
H  -6.95879 -1.0566 0.499664
H  -7.097285 -2.111452 -0.910479
H  -6.873827 -2.811783 0.677008
H  -5.001216 -3.424697 -1.683571
H  -3.440695 -3.107125 -0.936064
H  -4.669943 -4.03668 -0.081024
H  2.730951 0.362804 -2.738539
H  3.793828 1.700076 -2.37289
H  5.118073 -1.091298 0.672219
H  3.761074 -2.189968 0.617345
H  4.966568 -0.467246 -3.140209
H  5.585131 0.248931 -1.665601
H  5.297244 -2.228984 -1.453973
H  3.585054 -2.055644 -1.783593
elementType: O N C H
totalener: -1094.86832439 hartree
nucrepener: 2143.42090636 hartree
electener: -3238.28923075 hartree
oneelecener: -5749.43558258 hartree
twoeener: 2511.14635183 hartree
cpcmener: -0.03966032 hartree
kineticenergy: 1090.05396900 hartree
xcener: -105.976407967905 hartree
chargesum: -0.0000000
charge: -0.277369 -0.473337 -0.434443 -0.427978 -0.104311 0.163902 -0.004832 -0.140462 -0.292650 -0.269259 -0.284725 0.412224 -0.029994 0.084673 -0.227925 -0.253737 -0.092830 -0.024073 -0.065071 -0.073322 -0.137553 -0.135556 0.323870 0.309807 0.096378 0.101516 0.093972 0.091401 0.104459 0.092160 0.099512 0.097173 0.123455 0.136077 0.145165 0.089735 0.094680 0.094258 0.095626 0.089154 0.099001 0.101832 0.094359 0.101568 0.093458 0.081054 0.078577 0.081120 0.079258
qa: -0.2774 -0.4733 -0.4344 -0.4280 -0.1043 0.1639 -0.0048 -0.1405 -0.2926 -0.2693 -0.2847 0.4122 -0.0300 0.0847 -0.2279 -0.2537 -0.0928 -0.0241 -0.0651 -0.0733 -0.1376 -0.1356 0.3239 0.3098 0.0964 0.1015 0.0940 0.0914 0.1045 0.0922 0.0995 0.0972 0.1235 0.1361 0.1452 0.0897 0.0947 0.0943 0.0956 0.0892 0.0990 0.1018 0.0944 0.1016 0.0935 0.0811 0.0786 0.0811 0.0793
va: 2.1131 2.0345 2.0658 2.0801 3.0820 3.6764 3.7952 3.8626 3.9003 3.8979 3.8706 4.1982 3.7048 3.8889 3.9251 3.9438 3.7149 3.6212 3.9127 3.9100 3.9198 3.9154 4.1599 4.1935 1.0258 1.0336 1.0085 1.0129 1.0026 1.0018 1.0029 1.0026 1.0071 1.0135 0.9924 1.0079 0.9963 0.9953 0.9976 1.0079 0.9973 1.0060 1.0159 1.0039 1.0157 1.0093 1.0061 1.0094 1.0071
dispcorr: -0.025209811 hartree
energy: -1094.893534200102
dipole: -18.58423 18.91750 0.33326 -14.99298 14.81266 -0.18032 -18.63871 17.00997 -1.62874
magnitude: 1.67224 au
magnitude: 4.25049 debye
