program: Orca
programVersion: 5.0.2
elementType: O O O O N C C C C C C C C C C C C C C C C C C C H H H H H H H H H H H H H H H H H H H H H H H H H
charge: 0
multiplicity: 1
keywords: wb97x-d3
keywords: def2-TZVPP
keywords: def2/J RIJCOSX
keywords: DEFGRID2
keywords: scfconv7
keywords: smallprint printgap noloewdin
keywords: NOSOSCF
formula: C19H25NO4
InChI: InChI=1/C19H25NO4/c1-11(2)9-14-15(19(14,3)4)18(23)24-10-20-16(21)12-7-5-6-8-13(12)17(20)22/h9,14-15H,5-8,10H2,1-4H3
49 atoms
O  -0.231014 0.972974 0.158582
O  -1.76904 2.253735 -0.831168
O  2.073383 -0.077424 -2.104827
O  2.515219 1.758834 2.025854
N  2.037729 1.135717 -0.143209
C  -3.777704 0.596114 0.932335
C  -3.709847 -0.03851 -0.422148
C  -2.422659 0.258382 0.335229
C  -4.247601 2.026554 1.028072
C  -4.184492 -0.233723 2.127133
C  -4.071532 -1.448315 -0.662786
C  -1.490519 1.273052 -0.178547
C  -4.780168 -1.932025 -1.688728
C  0.808216 1.823187 -0.326655
C  -5.059024 -3.40193 -1.79448
C  -5.35864 -1.110882 -2.799605
C  3.713758 -0.4319 -0.359366
C  3.842081 0.106026 0.854792
C  4.609322 -1.464192 -0.935426
C  4.889061 -0.255201 1.840915
C  5.878007 -1.568487 -0.0873
C  5.567504 -1.556793 1.408829
C  2.536686 0.177461 -1.021694
C  2.757779 1.098807 1.047055
H  -3.906711 0.649548 -1.237384
H  -1.935493 -0.600853 0.782001
H  -3.760433 2.546819 1.854988
H  -4.076322 2.598406 0.119273
H  -5.321851 2.039521 1.221704
H  -3.758156 -1.235487 2.115762
H  -3.860015 0.249556 3.05041
H  -5.270813 -0.332863 2.17074
H  -3.712599 -2.159863 0.075026
H  0.826687 2.759336 0.230326
H  0.675023 2.043453 -1.38474
H  -6.134345 -3.597142 -1.8124
H  -4.656608 -3.810657 -2.724972
H  -4.628417 -3.963884 -0.96594
H  -4.986145 -1.458407 -3.766469
H  -6.44505 -1.226133 -2.83096
H  -5.142656 -0.047311 -2.723145
H  4.081321 -2.422486 -0.964732
H  4.851362 -1.221171 -1.972482
H  5.61833 0.558403 1.905914
H  4.454317 -0.352335 2.838295
H  6.417835 -2.478726 -0.350339
H  6.538936 -0.730769 -0.32602
H  6.483947 -1.697679 1.982684
H  4.913126 -2.399241 1.648797
elementType: O N C H
totalener: -1094.87135672 hartree
nucrepener: 2035.58267337 hartree
electener: -3130.45403009 hartree
oneelecener: -5533.29300437 hartree
twoeener: 2402.83897428 hartree
cpcmener: -0.03746030 hartree
kineticenergy: 1090.02784273 hartree
xcener: -105.970759480057 hartree
chargesum: -0.0000000
charge: -0.280147 -0.498255 -0.433601 -0.432751 -0.120999 0.106306 0.042298 -0.090350 -0.276901 -0.270895 -0.281279 0.420821 -0.053999 0.092633 -0.217062 -0.251156 -0.063949 -0.068900 -0.073088 -0.070839 -0.135295 -0.135473 0.338645 0.337636 0.097040 0.088748 0.099831 0.090478 0.096637 0.090565 0.098128 0.097471 0.121536 0.139337 0.126108 0.093326 0.093604 0.089129 0.095983 0.096963 0.089859 0.102638 0.094117 0.101625 0.093899 0.081344 0.078401 0.080831 0.079003
qa: -0.2801 -0.4983 -0.4336 -0.4328 -0.1210 0.1063 0.0423 -0.0904 -0.2769 -0.2709 -0.2813 0.4208 -0.0540 0.0926 -0.2171 -0.2512 -0.0639 -0.0689 -0.0731 -0.0708 -0.1353 -0.1355 0.3386 0.3376 0.0970 0.0887 0.0998 0.0905 0.0966 0.0906 0.0981 0.0975 0.1215 0.1393 0.1261 0.0933 0.0936 0.0891 0.0960 0.0970 0.0899 0.1026 0.0941 0.1016 0.0939 0.0813 0.0784 0.0808 0.0790
va: 2.1121 2.0013 2.0767 2.0773 3.1442 3.6811 3.7706 3.8571 3.9012 3.9126 3.8750 4.1083 3.7632 3.8825 3.9186 3.9405 3.6768 3.6936 3.9202 3.9175 3.9154 3.9169 4.1893 4.1895 1.0273 1.0347 0.9991 1.0197 0.9995 1.0061 1.0015 1.0017 1.0104 0.9999 1.0067 0.9962 0.9963 1.0088 0.9967 0.9968 1.0105 1.0047 1.0147 1.0042 1.0153 1.0092 1.0067 1.0093 1.0068
dispcorr: -0.021449889 hartree
energy: -1094.892806609285
dipole: -20.78244 22.00749 1.22504 -15.55582 13.79130 -1.76452 0.66064 0.01271 0.67335
magnitude: 2.25115 au
magnitude: 5.72197 debye
