program: Gaussian 09
title: 000002093
version: EM64L-G09RevD.01
frameworkgroup: C1[X(C20H30)]
method: RPBEPBE
basis: SDD
operation: Freq
keyword: #p
keyword: freq=noraman
keyword: PBEPBE/SDD
title: #p freq=noraman PBEPBE/SDD
converged: YES YES NO NO
title: Mulliken charges:
elementType: C C C C C C C C C C C C C C C C C C C C H H H H H H H H H H H H H H H H H H H H H H H H H H H H H H
charge: 0.182227 -0.438598 -0.448143 0.276063 -0.496867 0.185920 -0.734595 -0.743005 -0.356148 -0.840224 -0.336579 0.394135 -0.837155 -0.358644 -0.239213 -0.330030 0.425489 -0.825499 -0.307553 -0.745494 0.197785 0.198265 0.206915 0.204549 0.209216 0.210860 0.214911 0.206689 0.222461 0.211543 0.226510 0.210712 0.214457 0.220650 0.263171 0.213242 0.236914 0.227939 0.226246 0.232195 0.210141 0.228236 0.214532 0.220154 0.229694 0.230015 0.208992 0.228198 0.228321 0.220399
chargesum: 0.00000
title: Mulliken charges with hydrogens summed into heavy atoms:
elementType: C C C C C C C C C C C C C C C C C C C C
charge: 0.182227 -0.042548 -0.036679 0.276063 -0.076791 0.185920 -0.090534 -0.094240 -0.141691 -0.143161 -0.099665 0.394135 -0.150775 -0.148503 -0.010977 -0.115498 0.425489 -0.145636 -0.098561 -0.068576
polarizability: 5.87132425e+02 -2.26420654e+01 2.14925829e+02 -2.43634225e+01 1.03910367e+01 1.47836577e+02
1716.lowfreq: -0.0009 0.0006 0.0007 3.6221 4.0727 13.8920 21.7837 32.6630 37.5246
frequency: 21.3920 32.6074 37.2990 56.2487 62.7472 83.8133 93.3810 103.9541 112.8291 124.6060 140.6672 150.7210 167.1490 181.7837 194.5346 203.0101 237.6236 244.4300 251.2215 264.0817 290.0973 304.7377 314.1861 329.3434 332.8112 351.4124 367.5519 377.6340 403.7866 423.1098 434.8751 467.9574 492.5513 500.8479 515.3195 525.2069 568.0627 584.3140 599.8206 636.7116 724.4438 788.6095 795.9674 812.4576 842.9199 849.3628 863.5295 881.8701 885.5925 898.2487 903.8649 925.4439 939.2425 962.0084 963.3258 975.6633 977.7870 994.1103 1003.5635 1013.8414 1030.2264 1032.0178 1037.4852 1039.7991 1042.3703 1048.0575 1087.2373 1095.7487 1125.5588 1139.8895 1170.7740 1192.0838 1197.1948 1203.5412 1213.5459 1216.0436 1254.5404 1264.0475 1271.6351 1283.4992 1301.7941 1317.6239 1329.5329 1340.0425 1342.7865 1357.6555 1370.5145 1375.5188 1382.1961 1390.8888 1395.2149 1396.5873 1401.0635 1403.9901 1450.8711 1457.6153 1461.6173 1463.3964 1465.1243 1468.1120 1471.3085 1473.0277 1473.6447 1474.7150 1475.6432 1475.8200 1478.7244 1479.1543 1488.9735 1574.4897 1584.8024 1618.5433 1629.2584 1641.5125 2930.7997 2954.1024 2959.8779 2963.2927 2969.9061 2973.1817 2974.0763 2976.8316 2981.7075 2997.4328 3021.7949 3023.4254 3026.3370 3042.5793 3042.9470 3049.1497 3061.6378 3066.6334 3069.3226 3071.1511 3075.2637 3076.1641 3077.6304 3080.3621 3087.2626 3094.5062 3103.3731 3103.9114 3111.5663 3122.4055
redmass: 3.4919 3.5119 2.9447 3.1311 2.8496 3.2481 1.1247 2.6531 2.3072 1.5533 1.0770 1.4254 3.1140 1.6185 1.7388 1.7764 1.6151 1.3765 2.1904 1.9627 2.0451 2.8182 2.5381 2.8074 2.5419 2.7135 2.8016 2.1124 2.5042 2.9340 3.4687 3.4582 2.6501 3.0817 2.8229 2.6213 2.4913 2.7762 3.2073 3.9414 3.0577 2.6846 2.9627 1.2332 1.5945 2.2586 1.9873 1.6735 2.2063 1.9546 1.7230 1.5767 1.8787 1.1196 1.6159 1.2052 1.4814 1.3986 1.4301 1.5897 1.9280 1.4785 1.4910 1.6368 1.5463 1.5838 1.6062 2.7343 1.6053 3.0234 2.0957 2.6788 2.5186 1.9673 2.1254 1.3666 1.6969 1.6283 1.3542 1.7358 1.5001 1.5712 1.8020 1.5053 1.8277 1.7812 1.2959 1.1870 1.4530 1.2031 1.2051 1.2816 1.4056 1.5153 1.0888 1.0688 1.0471 1.0533 1.0720 1.0868 1.0491 1.0607 1.0487 1.1047 1.0739 1.0650 1.0968 1.0624 1.0654 5.4406 4.4517 5.9212 5.1897 5.4679 1.0655 1.0407 1.0390 1.0584 1.0357 1.0398 1.0372 1.0391 1.0710 1.0837 1.0987 1.0962 1.0932 1.0969 1.1030 1.0974 1.0991 1.0982 1.0891 1.0888 1.0995 1.0894 1.0973 1.0970 1.0885 1.0951 1.0948 1.0947 1.0883 1.0877
irintensity: 0.1440 0.3277 0.2345 0.6237 0.2741 0.1561 0.8452 0.3426 0.0895 0.0487 1.5842 0.1207 0.5738 0.2431 0.0774 0.5605 0.0273 0.2958 1.1920 1.6282 1.5814 0.8787 0.4243 0.0277 1.2774 1.3261 0.5535 1.1023 3.6765 0.8401 5.0464 1.2020 3.4494 4.4854 2.3021 0.0558 2.6885 10.5967 0.4193 2.4374 6.7247 6.6241 2.1779 20.3142 0.4477 5.3156 2.2736 3.8310 5.4693 5.2558 5.0496 0.7988 0.4603 13.4723 9.7567 85.4020 19.4785 19.4970 3.6331 14.9129 11.2337 0.8527 0.2105 18.8673 0.8078 2.6198 4.4664 0.7523 9.4001 3.7635 7.2340 3.9278 3.4217 18.0711 13.7055 3.7209 3.6963 13.4237 2.3296 25.2820 8.0834 3.1249 4.7816 3.0935 1.4066 6.8101 1.8239 19.1527 4.5262 19.9497 12.7844 1.4840 2.8665 35.1710 6.1925 0.4814 5.3468 1.1395 21.5553 10.7195 31.8771 7.9365 8.1772 17.0919 17.9324 9.9451 13.7573 13.2978 12.0433 4.7050 2.6916 54.1613 1.1198 24.9125 43.0373 51.4400 90.4795 30.0578 36.1603 38.2836 39.9732 27.2364 29.8774 77.5876 75.2662 24.4551 51.4554 18.3670 62.9843 23.7260 6.3148 131.0743 3.2797 2.2912 21.5179 18.6687 25.9800 18.8653 43.7700 36.8950 2.0382 75.5397 20.4598 49.7153
temp: 298.150 k
press: 1.00000 atm
elementType: 6 6 6 6 6 6 6 6 6 6 6 6 6 6 6 6 6 6 6 6 1 1 1 1 1 1 1 1 1 1 1 1 1 1 1 1 1 1 1 1 1 1 1 1 1 1 1 1 1 1
symmnumber: 1
zpe: 1153391.4 jmol-1
zpe.correction: 0.439304 hartree
zpe.thermalcorrener: 0.463090 hartree
zpe.thermalcorrenthalpy: 0.464034 hartree
zpe.thermalcorrgfe: 0.385571 hartree
zpe.sumelectzpe: -778.532088 hartree
zpe.sumelectthermal: -778.508301 hartree
zpe.sumelectthermalent: -778.507357 hartree
zpe.sumelectthermalfe: -778.585820 hartree
dipole: -0.2197 0.0618 -0.0448
dipole: 0.2326
quadrupole: -107.7811 -118.0209 -128.5776
quadrupole: 1.3123 0.4504 3.9420
quadrupole: 10.3454 0.1056 -10.4511 1.3123 0.4504 3.9420
hfenergy: -778.9713911 hartree
pointgroup: C01 [X(C20H30)]
dipole: 0.086538 0.0245437 0.0167592 debye
polarizability: 587.3668528|19.9340412|213.8681332|-24.9528447|-12.6985691|148.6598442 unknown
InChI: InChI=1S/C20H30/c1-7-16(2)10-8-11-17(3)13-14-19-18(4)12-9-15-20(19,5)6/h7-8,10-11,13-14H,9,12,15H2,1-6H3
charge 0 multiplicity 1
50 atoms
C  -4.109796 -0.911043 -0.350923
C  -5.372245 -0.188847 -0.90646
C  -5.809579 0.999941 -0.036176
C  -3.011144 0.115592 0.0615
C  -4.682143 2.047725 0.005581
C  -3.293566 1.458208 0.241574
C  -3.5815 -1.847066 -1.476967
C  -4.505581 -1.780272 0.881933
C  -1.684284 -0.484386 0.300787
C  -2.273317 2.485016 0.708197
C  -0.441214 0.051225 0.034704
C  0.841716 -0.59543 0.299599
C  0.845909 -1.969122 0.947901
C  2.005892 0.082252 -0.049008
C  3.373622 -0.349414 0.128199
C  4.462444 0.41163 -0.254843
C  5.873219 0.047149 -0.105097
C  6.202867 -1.292823 0.532309
C  6.829608 0.936285 -0.548694
C  8.331052 0.802381 -0.509419
H  -6.191002 -0.92962 -1.002427
H  -5.151983 0.180802 -1.929312
H  -6.036793 0.655815 0.991179
H  -6.737802 1.452489 -0.434788
H  -4.889629 2.800682 0.792769
H  -4.668529 2.617871 -0.950599
H  -2.743902 -2.481361 -1.136133
H  -4.393645 -2.515028 -1.823401
H  -3.225523 -1.258365 -2.342267
H  -3.631156 -2.301666 1.312079
H  -4.951115 -1.163503 1.68257
H  -5.242359 -2.551405 0.585555
H  -1.704799 -1.510643 0.696065
H  -1.81762 3.030594 -0.143855
H  -1.450573 2.027559 1.282629
H  -2.762314 3.248366 1.343088
H  -0.381135 1.035336 -0.449005
H  0.294356 -2.699807 0.324866
H  1.863197 -2.361583 1.098373
H  0.345137 -1.942976 1.93474
H  1.879775 1.072858 -0.515405
H  3.552778 -1.327389 0.592085
H  4.26601 1.391042 -0.719551
H  7.287182 -1.474591 0.592326
H  5.753543 -2.123598 -0.044546
H  5.794506 -1.351065 1.559378
H  6.462534 1.875339 -0.993409
H  8.758642 0.87402 -1.529746
H  8.783991 1.627858 0.076076
H  8.672469 -0.148433 -0.06813
