program: Orca
programVersion: 5.0.2
elementType: O O O O N C C C C C C C C C C C C C C C C C C C H H H H H H H H H H H H H H H H H H H H H H H H H
charge: 0
multiplicity: 1
keywords: wb97x-d3
keywords: def2-TZVPP
keywords: def2/J RIJCOSX
keywords: DEFGRID2
keywords: scfconv7
keywords: smallprint printgap noloewdin
keywords: NOSOSCF
formula: C19H25NO4
InChI: InChI=1/C19H25NO4/c1-11(2)9-14-15(19(14,3)4)18(23)24-10-20-16(21)12-7-5-6-8-13(12)17(20)22/h9,14-15H,5-8,10H2,1-4H3
49 atoms
O  -0.212202 1.518265 0.041358
O  -1.386519 1.148975 -1.836123
O  3.085345 2.568442 1.189042
O  1.531558 -0.528774 -1.747189
N  2.054827 1.286402 -0.430801
C  -3.709245 0.888766 0.291844
C  -3.338295 -0.446118 -0.27485
C  -2.252164 0.443595 0.278831
C  -4.191144 1.971008 -0.640895
C  -4.36147 0.937045 1.65068
C  -3.660551 -1.717648 0.421253
C  -1.274823 1.05339 -0.637353
C  -4.731105 -2.472656 0.160967
C  0.887429 2.068054 -0.674289
C  -4.975437 -3.757367 0.89132
C  -5.767059 -2.11502 -0.859978
C  3.948106 0.401694 0.538438
C  3.486923 -0.515333 -0.313823
C  5.178666 0.2652 1.354861
C  4.108358 -1.838618 -0.561936
C  6.007712 -0.90888 0.832025
C  5.137665 -2.128605 0.532312
C  3.027062 1.564264 0.524772
C  2.253678 0.010945 -0.945799
H  -3.368469 -0.489018 -1.359901
H  -1.850703 0.176255 1.250432
H  -3.801734 1.872867 -1.651819
H  -5.280161 1.935138 -0.708154
H  -3.920019 2.960693 -0.267714
H  -4.214897 1.913459 2.115804
H  -5.437076 0.772377 1.559269
H  -3.968847 0.182244 2.331001
H  -2.969124 -2.047639 1.19125
H  1.058224 3.076503 -0.305242
H  0.686795 2.115167 -1.74161
H  -5.934424 -3.732884 1.414961
H  -5.025558 -4.59939 0.19621
H  -4.195875 -3.969969 1.622527
H  -6.758404 -2.080867 -0.401269
H  -5.589928 -1.152183 -1.336765
H  -5.818497 -2.87487 -1.644183
H  5.755086 1.192735 1.331607
H  4.900443 0.107548 2.401634
H  3.342398 -2.616793 -0.594833
H  4.581071 -1.837372 -1.549043
H  6.52798 -0.603605 -0.080128
H  6.776869 -1.165545 1.561094
H  4.616357 -2.432822 1.444206
H  5.762151 -2.970592 0.232347
elementType: O N C H
totalener: -1094.86895318 hartree
nucrepener: 2056.84279093 hartree
electener: -3151.71174411 hartree
oneelecener: -5576.14415093 hartree
twoeener: 2424.43240682 hartree
cpcmener: -0.03911781 hartree
kineticenergy: 1090.03898802 hartree
xcener: -105.973005779087 hartree
chargesum: -0.0000000
charge: -0.286433 -0.484248 -0.434329 -0.436649 -0.101773 0.134072 -0.010620 -0.137076 -0.295136 -0.270529 -0.259053 0.441949 -0.039271 0.082026 -0.230579 -0.250016 -0.078910 -0.056548 -0.073312 -0.071979 -0.134781 -0.136499 0.344069 0.333952 0.098963 0.097203 0.093816 0.097296 0.103595 0.100712 0.097531 0.093056 0.124387 0.127174 0.140053 0.094632 0.095215 0.090070 0.096383 0.087593 0.101432 0.094163 0.102617 0.093970 0.101586 0.078728 0.081014 0.078904 0.081579
qa: -0.2864 -0.4842 -0.4343 -0.4366 -0.1018 0.1341 -0.0106 -0.1371 -0.2951 -0.2705 -0.2591 0.4419 -0.0393 0.0820 -0.2306 -0.2500 -0.0789 -0.0565 -0.0733 -0.0720 -0.1348 -0.1365 0.3441 0.3340 0.0990 0.0972 0.0938 0.0973 0.1036 0.1007 0.0975 0.0931 0.1244 0.1272 0.1401 0.0946 0.0952 0.0901 0.0964 0.0876 0.1014 0.0942 0.1026 0.0940 0.1016 0.0787 0.0810 0.0789 0.0816
va: 2.1105 2.0235 2.0776 2.0747 3.1072 3.6774 3.7875 3.8655 3.9009 3.9069 3.8605 4.1576 3.7034 3.8586 3.9275 3.9392 3.7074 3.6728 3.9191 3.9175 3.9147 3.9156 4.1989 4.1993 1.0258 1.0358 1.0164 1.0007 0.9994 1.0030 1.0012 1.0017 1.0062 1.0143 1.0177 0.9962 0.9951 1.0074 0.9977 1.0079 0.9982 1.0152 1.0048 1.0152 1.0046 1.0067 1.0094 1.0068 1.0091
dispcorr: -0.022616623 hartree
energy: -1094.891569800910
dipole: -22.72044 23.58815 0.86771 -15.27842 14.23423 -1.04418 6.94992 -5.64172 1.30820
magnitude: 1.88537 au
magnitude: 4.79223 debye
