program: Orca
programVersion: 5.0.2
elementType: O O O O N C C C C C C C C C C C C C C C C C C C H H H H H H H H H H H H H H H H H H H H H H H H H
charge: 0
multiplicity: 1
keywords: wb97x-d3
keywords: def2-TZVPP
keywords: def2/J RIJCOSX
keywords: DEFGRID2
keywords: scfconv7
keywords: smallprint printgap noloewdin
keywords: NOSOSCF
formula: C19H25NO4
InChI: InChI=1/C19H25NO4/c1-11(2)9-14-15(19(14,3)4)18(23)24-10-20-16(21)12-7-5-6-8-13(12)17(20)22/h9,14-15H,5-8,10H2,1-4H3
49 atoms
O  -0.311859 -1.263881 -0.004562
O  -1.376991 -0.94299 -1.95674
O  1.471474 0.691367 -1.827154
O  2.940158 -2.197958 1.354483
N  1.969015 -1.040181 -0.391391
C  -2.702444 1.382851 -0.301389
C  -3.663459 0.256775 -0.455864
C  -2.267658 -0.032393 0.066779
C  -2.155574 2.05886 -1.534747
C  -2.843774 2.322578 0.87072
C  -4.839085 0.080485 0.434068
C  -1.310367 -0.774934 -0.762148
C  -5.467811 -1.079051 0.643453
C  0.819365 -1.852801 -0.629857
C  -6.671914 -1.166783 1.529608
C  -5.032093 -2.373203 0.03015
C  3.359516 0.795988 -0.312308
C  3.799041 -0.062265 0.609356
C  3.968517 2.114538 -0.609931
C  4.991541 0.141343 1.466004
C  4.949337 2.484686 0.503746
C  5.822592 1.300221 0.912823
C  2.166664 0.208432 -0.967149
C  2.898043 -1.239622 0.624574
H  -3.810847 -0.066752 -1.483284
H  -2.178431 -0.21207 1.131807
H  -1.133035 2.406105 -1.374621
H  -2.163627 1.420521 -2.415223
H  -2.765325 2.934361 -1.765586
H  -1.887542 2.800856 1.089018
H  -3.563315 3.112328 0.645848
H  -3.173699 1.817769 1.778263
H  -5.220271 0.969703 0.927865
H  0.668481 -1.98147 -1.698939
H  0.982928 -2.828585 -0.179088
H  -6.513657 -1.887307 2.335855
H  -6.922662 -0.206097 1.978723
H  -7.543691 -1.516809 0.970944
H  -4.772643 -3.095988 0.807876
H  -5.845608 -2.821827 -0.545008
H  -4.171614 -2.271093 -0.629032
H  4.47834 2.067535 -1.577173
H  3.191339 2.874828 -0.714686
H  4.669204 0.348922 2.491102
H  5.583655 -0.775142 1.515955
H  5.575173 3.315597 0.176725
H  4.38838 2.837188 1.37355
H  6.55229 1.613191 1.660181
H  6.390501 0.952319 0.045713
elementType: O N C H
totalener: -1094.86838646 hartree
nucrepener: 2088.60615039 hartree
electener: -3183.47453685 hartree
oneelecener: -5639.70991679 hartree
twoeener: 2456.23537994 hartree
cpcmener: -0.03823206 hartree
kineticenergy: 1090.04879335 hartree
xcener: -105.975241227784 hartree
chargesum: -0.0000000
charge: -0.286946 -0.485410 -0.439783 -0.434126 -0.097429 0.164225 -0.039119 -0.095175 -0.281549 -0.291073 -0.286753 0.405455 -0.011129 0.082252 -0.230094 -0.245222 -0.056244 -0.079906 -0.070369 -0.073395 -0.135380 -0.135519 0.334604 0.345349 0.103364 0.094392 0.095321 0.094410 0.099358 0.099250 0.100355 0.093025 0.126052 0.140189 0.126221 0.094474 0.090111 0.096690 0.098532 0.099825 0.079559 0.101160 0.094071 0.102661 0.094066 0.081026 0.078809 0.080688 0.079126
qa: -0.2869 -0.4854 -0.4398 -0.4341 -0.0974 0.1642 -0.0391 -0.0952 -0.2815 -0.2911 -0.2868 0.4055 -0.0111 0.0823 -0.2301 -0.2452 -0.0562 -0.0799 -0.0704 -0.0734 -0.1354 -0.1355 0.3346 0.3453 0.1034 0.0944 0.0953 0.0944 0.0994 0.0993 0.1004 0.0930 0.1261 0.1402 0.1262 0.0945 0.0901 0.0967 0.0985 0.0998 0.0796 0.1012 0.0941 0.1027 0.0941 0.0810 0.0788 0.0807 0.0791
va: 2.1067 2.0138 2.0667 2.0775 3.1061 3.6963 3.8442 3.8092 3.8789 3.9145 3.8843 4.1317 3.7037 3.8707 3.9287 3.9408 3.6763 3.7095 3.9170 3.9179 3.9162 3.9154 4.1866 4.1964 1.0233 1.0327 1.0063 1.0160 1.0026 1.0023 0.9990 1.0009 1.0020 1.0156 1.0150 0.9964 1.0063 0.9957 0.9980 0.9991 1.0155 1.0048 1.0150 1.0049 1.0152 1.0092 1.0066 1.0095 1.0065
dispcorr: -0.023315122 hartree
energy: -1094.891701582347
dipole: -18.06211 19.16210 1.09998 11.53123 -10.39995 1.13128 6.98289 -5.63150 1.35140
magnitude: 2.07750 au
magnitude: 5.28059 debye
