program: Orca
programVersion: 5.0.2
elementType: O O O O N C C C C C C C C C C C C C C C C C C C H H H H H H H H H H H H H H H H H H H H H H H H H
charge: 0
multiplicity: 1
keywords: wb97x-d3
keywords: def2-TZVPP
keywords: def2/J RIJCOSX
keywords: DEFGRID2
keywords: scfconv7
keywords: smallprint printgap noloewdin
keywords: NOSOSCF
formula: C19H25NO4
InChI: InChI=1/C19H25NO4/c1-11(2)9-14-15(19(14,3)4)18(23)24-10-20-16(21)12-7-5-6-8-13(12)17(20)22/h9,14-15H,5-8,10H2,1-4H3
49 atoms
O  -0.561862 1.732114 1.389725
O  -0.529193 1.691905 -0.843748
O  2.527684 2.405543 -0.910942
O  1.39922 -0.393796 2.489639
N  1.715932 1.276829 0.936027
C  -3.58797 1.165802 -0.648425
C  -2.931414 -0.176996 -0.580916
C  -2.470003 0.943188 0.350529
C  -3.377223 2.002113 -1.88744
C  -4.961125 1.362394 -0.049318
C  -3.580173 -1.364525 0.002628
C  -1.113486 1.489028 0.192109
C  -3.419978 -2.635217 -0.383745
C  0.769441 2.222486 1.435848
C  -4.162097 -3.741263 0.304791
C  -2.533699 -3.088935 -1.503678
C  3.204444 0.141389 -0.404035
C  2.872314 -0.684298 0.5888
C  4.161471 -0.17291 -1.492277
C  3.376383 -2.069464 0.752684
C  4.951737 -1.430963 -1.127648
C  4.052672 -2.520429 -0.543617
C  2.471263 1.419706 -0.22392
C  1.91814 0.016676 1.483128
H  -2.244491 -0.367231 -1.398412
H  -2.792219 0.847895 1.381349
H  -4.207677 1.835237 -2.576692
H  -3.361372 3.067363 -1.648108
H  -2.460775 1.763541 -2.421284
H  -5.09103 0.85647 0.906458
H  -5.149251 2.424515 0.119266
H  -5.732938 0.994713 -0.728705
H  -4.252066 -1.178156 0.835199
H  0.953183 2.423541 2.488825
H  0.876238 3.151939 0.876487
H  -4.828536 -3.370514 1.083768
H  -4.763099 -4.314189 -0.40674
H  -3.470171 -4.452269 0.764693
H  -1.885051 -2.310674 -1.898187
H  -1.896303 -3.913129 -1.177364
H  -3.129403 -3.474027 -2.334494
H  3.610921 -0.316618 -2.427654
H  4.830989 0.673093 -1.665699
H  4.080142 -2.10329 1.590663
H  2.557741 -2.741689 1.020994
H  5.469559 -1.806433 -2.011406
H  5.724984 -1.170756 -0.399094
H  4.633205 -3.425038 -0.357076
H  3.285022 -2.787117 -1.275732
elementType: O N C H
totalener: -1094.87910007 hartree
nucrepener: 2121.62438765 hartree
electener: -3216.50348772 hartree
oneelecener: -5705.88773530 hartree
twoeener: 2489.38424758 hartree
cpcmener: -0.03294571 hartree
kineticenergy: 1090.04827935 hartree
xcener: -105.973665057596 hartree
chargesum: -0.0000000
charge: -0.284757 -0.464620 -0.403057 -0.410140 -0.102910 0.114235 0.023443 -0.101413 -0.277106 -0.279009 -0.266862 0.408561 -0.045941 0.090451 -0.217702 -0.256309 -0.061599 -0.081868 -0.072596 -0.074928 -0.136702 -0.137175 0.315487 0.309666 0.102791 0.087714 0.093634 0.097488 0.093376 0.090319 0.096800 0.098253 0.115121 0.142547 0.131585 0.087401 0.091918 0.093799 0.091448 0.092422 0.099920 0.101094 0.093077 0.100169 0.093519 0.081436 0.077431 0.080681 0.078907
qa: -0.2848 -0.4646 -0.4031 -0.4101 -0.1029 0.1142 0.0234 -0.1014 -0.2771 -0.2790 -0.2669 0.4086 -0.0459 0.0905 -0.2177 -0.2563 -0.0616 -0.0819 -0.0726 -0.0749 -0.1367 -0.1372 0.3155 0.3097 0.1028 0.0877 0.0936 0.0975 0.0934 0.0903 0.0968 0.0983 0.1151 0.1425 0.1316 0.0874 0.0919 0.0938 0.0914 0.0924 0.0999 0.1011 0.0931 0.1002 0.0935 0.0814 0.0774 0.0807 0.0789
va: 2.1142 2.0466 2.1142 2.1075 3.0753 3.6825 3.8055 3.8128 3.8967 3.9157 3.8917 4.1624 3.7622 3.8861 3.9215 3.9389 3.6469 3.6880 3.9163 3.9199 3.9135 3.9148 4.2136 4.2185 1.0210 1.0364 0.9996 1.0002 1.0210 1.0068 1.0014 1.0008 1.0122 0.9922 1.0165 1.0091 0.9954 0.9966 1.0110 0.9976 0.9959 1.0049 1.0161 1.0049 1.0153 1.0093 1.0066 1.0095 1.0066
dispcorr: -0.022828768 hartree
energy: -1094.901928834922
dipole: -17.83460 18.08243 0.24783 -18.34932 16.96131 -1.38801 -10.22713 10.22014 -0.00699
magnitude: 1.40997 au
magnitude: 3.58387 debye
