program: Orca
programVersion: 5.0.2
elementType: O O O O N C C C C C C C C C C C C C C C C C C C H H H H H H H H H H H H H H H H H H H H H H H H H
charge: 0
multiplicity: 1
keywords: wb97x-d3
keywords: def2-TZVPP
keywords: def2/J RIJCOSX
keywords: DEFGRID2
keywords: scfconv7
keywords: smallprint printgap noloewdin
keywords: NOSOSCF
formula: C19H25NO4
InChI: InChI=1/C19H25NO4/c1-11(2)9-14-15(19(14,3)4)18(23)24-10-20-16(21)12-7-5-6-8-13(12)17(20)22/h9,14-15H,5-8,10H2,1-4H3
49 atoms
O  -0.544463 1.712904 1.250609
O  -0.634055 1.586416 -0.978608
O  2.405379 2.209749 -1.246328
O  1.619532 -0.16501 2.551099
N  1.733345 1.283779 0.76388
C  -3.695697 1.17549 -0.549178
C  -3.061024 -0.178035 -0.604758
C  -2.504188 0.879971 0.343895
C  -3.562594 2.078712 -1.751085
C  -5.012532 1.36132 0.167882
C  -3.688615 -1.385737 -0.040527
C  -1.15883 1.421882 0.095138
C  -3.580797 -2.636535 -0.502186
C  0.771856 2.243454 1.203448
C  -4.292518 -3.764384 0.183835
C  -2.77816 -3.049724 -1.69782
C  3.263731 0.087731 -0.473515
C  3.037316 -0.611576 0.638728
C  4.19908 -0.306643 -1.554762
C  3.659609 -1.916912 0.968308
C  5.103781 -1.436214 -1.058783
C  4.321204 -2.495586 -0.284041
C  2.441167 1.323538 -0.434082
C  2.06165 0.133887 1.471439
H  -2.443164 -0.332079 -1.482625
H  -2.743913 0.744191 1.392443
H  -2.692543 1.857818 -2.364279
H  -4.444251 1.964756 -2.385283
H  -3.508777 3.127896 -1.452763
H  -5.084413 0.788327 1.091238
H  -5.156638 2.412089 0.426769
H  -5.843607 1.063089 -0.474642
H  -4.297386 -1.234375 0.84583
H  0.983759 2.546557 2.226202
H  0.830801 3.120048 0.558645
H  -4.976022 -4.272458 -0.501989
H  -3.585297 -4.522431 0.531555
H  -4.870878 -3.426086 1.043664
H  -2.02999 -3.794705 -1.415497
H  -3.417802 -3.527158 -2.444361
H  -2.256088 -2.231133 -2.188393
H  3.62429 -0.624985 -2.430452
H  4.789025 0.553201 -1.88101
H  4.394028 -1.778576 1.768099
H  2.90907 -2.604398 1.365915
H  5.614676 -1.893786 -1.90714
H  5.882173 -1.017963 -0.414244
H  4.980701 -3.317684 -0.002766
H  3.550185 -2.92081 -0.932961
elementType: O N C H
totalener: -1094.88004038 hartree
nucrepener: 2106.04099466 hartree
electener: -3200.92103505 hartree
oneelecener: -5674.72255610 hartree
twoeener: 2473.80152105 hartree
cpcmener: -0.03320268 hartree
kineticenergy: 1090.04157830 hartree
xcener: -105.972384303494 hartree
chargesum: 0.0000000
charge: -0.284739 -0.463747 -0.402158 -0.409873 -0.101679 0.105783 0.026320 -0.101415 -0.273904 -0.278830 -0.265683 0.413299 -0.049260 0.086371 -0.217754 -0.252149 -0.069617 -0.083219 -0.074268 -0.075096 -0.136037 -0.136642 0.322193 0.313922 0.100149 0.087652 0.093073 0.093666 0.097654 0.090067 0.097184 0.098476 0.115174 0.143343 0.131371 0.092795 0.092546 0.087883 0.094980 0.096091 0.089598 0.101704 0.093153 0.100428 0.093514 0.080551 0.077777 0.080757 0.078594
qa: -0.2847 -0.4637 -0.4022 -0.4099 -0.1017 0.1058 0.0263 -0.1014 -0.2739 -0.2788 -0.2657 0.4133 -0.0493 0.0864 -0.2178 -0.2521 -0.0696 -0.0832 -0.0743 -0.0751 -0.1360 -0.1366 0.3222 0.3139 0.1001 0.0877 0.0931 0.0937 0.0977 0.0901 0.0972 0.0985 0.1152 0.1433 0.1314 0.0928 0.0925 0.0879 0.0950 0.0961 0.0896 0.1017 0.0932 0.1004 0.0935 0.0806 0.0778 0.0808 0.0786
va: 2.1157 2.0481 2.1143 2.1077 3.0768 3.6915 3.7957 3.8066 3.8988 3.9168 3.8886 4.1623 3.7694 3.8872 3.9203 3.9392 3.6497 3.6844 3.9196 3.9213 3.9142 3.9145 4.2164 4.2202 1.0241 1.0358 1.0207 1.0000 0.9999 1.0070 1.0013 1.0009 1.0124 0.9942 1.0171 0.9959 0.9966 1.0093 0.9968 0.9968 1.0118 1.0046 1.0163 1.0049 1.0154 1.0094 1.0067 1.0093 1.0067
dispcorr: -0.022535284 hartree
energy: -1094.902575667022
dipole: -18.24089 18.57808 0.33719 -17.97083 16.65859 -1.31224 -8.77384 8.90785 0.13400
magnitude: 1.36148 au
magnitude: 3.46060 debye
