program: Orca
programVersion: 5.0.2
elementType: O O O O N C C C C C C C C C C C C C C C C C C C H H H H H H H H H H H H H H H H H H H H H H H H H
charge: 0
multiplicity: 1
keywords: wb97x-d3
keywords: def2-TZVPP
keywords: def2/J RIJCOSX
keywords: DEFGRID2
keywords: scfconv7
keywords: smallprint printgap noloewdin
keywords: NOSOSCF
formula: C19H25NO4
InChI: InChI=1/C19H25NO4/c1-11(2)9-14-15(19(14,3)4)18(23)24-10-20-16(21)12-7-5-6-8-13(12)17(20)22/h9,14-15H,5-8,10H2,1-4H3
49 atoms
O  -0.534032 1.724844 1.410632
O  -0.404027 -0.506593 1.496222
O  1.499166 2.654386 -0.660269
O  2.53782 -0.397372 2.546099
N  1.782651 1.320746 1.197244
C  -2.277557 0.2155 -1.067037
C  -2.918227 -0.713243 -0.06965
C  -2.262363 0.551811 0.413662
C  -1.006774 -0.228906 -1.748872
C  -3.144603 1.082783 -1.944478
C  -4.384675 -0.857133 0.044809
C  -0.992092 0.492015 1.163246
C  -5.079988 -1.99487 -0.052273
C  0.745585 1.866777 2.013662
C  -6.572041 -1.997137 0.095914
C  -4.477316 -3.340911 -0.319902
C  2.977391 0.737577 -0.68418
C  3.277851 -0.15834 0.2564
C  3.508258 0.735411 -2.068477
C  4.224545 -1.287233 0.088047
C  4.168985 -0.614193 -2.356174
C  5.039458 -1.083737 -1.190765
C  2.012146 1.709766 -0.116298
C  2.517924 0.173659 1.487826
H  -2.343269 -1.61384 0.118398
H  -2.912829 1.373072 0.698732
H  -0.399726 -0.896314 -1.137861
H  -1.246966 -0.765705 -2.669204
H  -0.390202 0.630067 -2.024773
H  -2.587944 1.957185 -2.287687
H  -3.467288 0.529451 -2.829181
H  -4.038452 1.442423 -1.435982
H  -4.940505 0.058286 0.228262
H  0.785436 1.393414 2.994686
H  0.876273 2.939522 2.134401
H  -7.057574 -2.393257 -0.800372
H  -6.884562 -2.63975 0.923691
H  -6.969945 -0.998689 0.278727
H  -4.769509 -4.059207 0.451997
H  -4.846958 -3.744779 -1.267605
H  -3.389239 -3.336656 -0.372036
H  2.703318 0.93579 -2.780653
H  4.225266 1.554524 -2.186255
H  4.878582 -1.3675 0.959753
H  3.662547 -2.225887 0.047059
H  3.392948 -1.359587 -2.553137
H  4.768435 -0.540843 -3.264784
H  5.823077 -0.343658 -1.004248
H  5.545774 -2.013897 -1.452905
elementType: O N C H
totalener: -1094.87861513 hartree
nucrepener: 2140.90760193 hartree
electener: -3235.78621707 hartree
oneelecener: -5744.27909054 hartree
twoeener: 2508.49287347 hartree
cpcmener: -0.03271320 hartree
kineticenergy: 1090.03668098 hartree
xcener: -105.970544835464 hartree
chargesum: -0.0000000
charge: -0.271677 -0.445721 -0.407455 -0.400243 -0.099596 0.129179 0.020933 -0.112908 -0.280048 -0.268341 -0.276647 0.379388 -0.046401 0.085874 -0.220616 -0.250689 -0.093861 -0.027145 -0.078543 -0.066943 -0.134258 -0.139059 0.296834 0.292950 0.092019 0.097463 0.089894 0.104413 0.091305 0.099174 0.096950 0.088183 0.117786 0.134100 0.141679 0.092198 0.093611 0.088215 0.093794 0.096070 0.089792 0.093306 0.102282 0.093461 0.100902 0.079019 0.080360 0.077716 0.081303
qa: -0.2717 -0.4457 -0.4075 -0.4002 -0.0996 0.1292 0.0209 -0.1129 -0.2800 -0.2683 -0.2766 0.3794 -0.0464 0.0859 -0.2206 -0.2507 -0.0939 -0.0271 -0.0785 -0.0669 -0.1343 -0.1391 0.2968 0.2930 0.0920 0.0975 0.0899 0.1044 0.0913 0.0992 0.0970 0.0882 0.1178 0.1341 0.1417 0.0922 0.0936 0.0882 0.0938 0.0961 0.0898 0.0933 0.1023 0.0935 0.1009 0.0790 0.0804 0.0777 0.0813
va: 2.1170 2.0652 2.1019 2.1158 3.0681 3.7021 3.7978 3.8216 3.9015 3.8983 3.8651 4.2388 3.7574 3.8893 3.9228 3.9418 3.6899 3.6125 3.9198 3.9076 3.9123 3.9171 4.1947 4.2248 1.0323 1.0329 1.0135 1.0019 1.0086 1.0025 1.0022 1.0048 1.0095 1.0140 0.9926 0.9963 0.9962 1.0087 0.9974 0.9971 1.0100 1.0143 1.0052 1.0156 1.0055 1.0072 1.0096 1.0063 1.0093
dispcorr: -0.024965165 hartree
energy: -1094.903580299928
dipole: -18.24857 18.63430 0.38574 -14.60561 14.46646 -0.13915 -18.05982 16.57220 -1.48761
magnitude: 1.54310 au
magnitude: 3.92224 debye
