program: Orca
programVersion: 5.0.2
elementType: O O O O N C C C C C C C C C C C C C C C C C C C H H H H H H H H H H H H H H H H H H H H H H H H H
charge: 0
multiplicity: 1
keywords: wb97x-d3
keywords: def2-TZVPP
keywords: def2/J RIJCOSX
keywords: DEFGRID2
keywords: scfconv7
keywords: smallprint printgap noloewdin
keywords: NOSOSCF
formula: C19H25NO4
InChI: InChI=1/C19H25NO4/c1-11(2)9-14-15(19(14,3)4)18(23)24-10-20-16(21)12-7-5-6-8-13(12)17(20)22/h9,14-15H,5-8,10H2,1-4H3
49 atoms
O  -0.246931 0.287252 1.486112
O  -1.247978 -1.719811 1.540212
O  1.68678 -1.645002 -0.23994
O  2.913328 1.941261 2.262837
N  2.049852 0.032442 1.29486
C  -2.544684 -0.464662 -1.063738
C  -3.552557 -0.591254 0.04142
C  -2.236716 0.085695 0.322982
C  -1.855914 -1.708759 -1.56712
C  -2.775551 0.566096 -2.140841
C  -4.799365 0.21303 0.054077
C  -1.227489 -0.572526 1.171182
C  -6.009135 -0.238163 -0.288056
C  0.921789 -0.195109 2.135811
C  -7.212458 0.653217 -0.237451
C  -6.277644 -1.637241 -0.750605
C  3.496569 -0.051039 -0.496317
C  3.863042 0.991765 0.250312
C  4.165093 -0.481167 -1.748698
C  5.023377 1.873731 -0.025158
C  5.118068 0.618133 -2.222598
C  5.925588 1.211207 -1.067608
C  2.317795 -0.691638 0.139349
C  2.92873 1.104932 1.397544
H  -3.637489 -1.593651 0.451052
H  -2.245983 1.16857 0.393027
H  -1.77253 -2.489788 -0.81412
H  -2.422611 -2.12492 -2.402707
H  -0.851959 -1.484435 -1.933723
H  -1.836148 0.827489 -2.632009
H  -3.449237 0.173155 -2.905431
H  -3.215461 1.485801 -1.756823
H  -4.706644 1.251614 0.359419
H  0.83984 -1.25359 2.372944
H  1.054623 0.364966 3.059007
H  -7.687152 0.727484 -1.219571
H  -7.970862 0.254113 0.44157
H  -6.964369 1.661986 0.093051
H  -5.385636 -2.260104 -0.793833
H  -7.001161 -2.131847 -0.096933
H  -6.722483 -1.629798 -1.749342
H  4.708133 -1.414525 -1.567107
H  3.421529 -0.712002 -2.515648
H  4.66551 2.845363 -0.381288
H  5.573509 2.076483 0.897131
H  5.789635 0.216536 -2.982586
H  4.540043 1.412725 -2.703185
H  6.643158 1.94018 -1.446646
H  6.507581 0.418925 -0.587662
elementType: O N C H
totalener: -1094.87924706 hartree
nucrepener: 2072.26861463 hartree
electener: -3167.14786169 hartree
oneelecener: -5606.87904488 hartree
twoeener: 2439.73118319 hartree
cpcmener: -0.03121476 hartree
kineticenergy: 1090.04002727 hartree
xcener: -105.970324978733 hartree
chargesum: 0.0000000
charge: -0.280244 -0.450674 -0.411776 -0.408934 -0.095450 0.153514 -0.014206 -0.123156 -0.296854 -0.267268 -0.259668 0.392913 -0.034707 0.079444 -0.228557 -0.249416 -0.060244 -0.079658 -0.071597 -0.076011 -0.136409 -0.134399 0.314650 0.324427 0.097856 0.093383 0.097054 0.098183 0.093733 0.098696 0.096018 0.090969 0.119713 0.139979 0.124278 0.093227 0.094589 0.088273 0.087473 0.097943 0.095156 0.100348 0.094542 0.101117 0.093248 0.080641 0.078633 0.080817 0.078414
qa: -0.2802 -0.4507 -0.4118 -0.4089 -0.0955 0.1535 -0.0142 -0.1232 -0.2969 -0.2673 -0.2597 0.3929 -0.0347 0.0794 -0.2286 -0.2494 -0.0602 -0.0797 -0.0716 -0.0760 -0.1364 -0.1344 0.3146 0.3244 0.0979 0.0934 0.0971 0.0982 0.0937 0.0987 0.0960 0.0910 0.1197 0.1400 0.1243 0.0932 0.0946 0.0883 0.0875 0.0979 0.0952 0.1003 0.0945 0.1011 0.0932 0.0806 0.0786 0.0808 0.0784
va: 2.1121 2.0609 2.1011 2.1092 3.0936 3.6689 3.7948 3.8794 3.8941 3.9037 3.8668 4.1956 3.7065 3.8637 3.9272 3.9419 3.6658 3.6926 3.9210 3.9203 3.9147 3.9124 4.2117 4.2244 1.0256 1.0363 1.0166 1.0026 1.0078 1.0029 1.0029 1.0022 1.0076 1.0175 1.0146 0.9964 0.9954 1.0080 1.0087 0.9982 0.9975 1.0051 1.0150 1.0054 1.0157 1.0095 1.0065 1.0096 1.0067
dispcorr: -0.023241941 hartree
energy: -1094.902489002929
dipole: -20.64849 21.67881 1.03033 0.42297 0.52982 0.95278 -19.44054 17.85703 -1.58351
magnitude: 2.11586 au
magnitude: 5.37809 debye
