program: Gaussian 09
title: 000062329
version: EM64L-G09RevD.01
frameworkgroup: C1[X(C12H15N3O6)]
method: RPBEPBE
basis: SDD
operation: Freq
keyword: #p
keyword: freq=noraman
keyword: PBEPBE/SDD
title: #p freq=noraman PBEPBE/SDD
converged: YES YES NO NO
title: Mulliken charges:
elementType: O O O O O O N N N C C C C C C C C C C C C H H H H H H H H H H H H H H H
charge: -0.155336 -0.164462 -0.168493 -0.161220 -0.165403 -0.164421 -0.029891 -0.031427 -0.010897 0.129244 0.245503 0.123737 0.089282 -0.712913 -0.722281 -0.721715 0.182215 0.174479 0.150612 -0.781261 -0.782303 0.221315 0.248191 0.246608 0.222539 0.232768 0.243759 0.222192 0.243139 0.233748 0.246045 0.285228 0.246727 0.249935 0.253266 0.281490
chargesum: 0.00000
title: Mulliken charges with hydrogens summed into heavy atoms:
elementType: O O O O O O N N N C C C C C C C C C C C C
charge: -0.155336 -0.164462 -0.168493 -0.161220 -0.165403 -0.164421 -0.029891 -0.031427 -0.010897 0.129244 0.245503 0.123737 0.089282 0.003200 -0.023215 -0.022635 0.182215 0.174479 0.150612 -0.003260 0.002389
polarizability: 2.14557961e+02 1.41048324e-01 1.95161736e+02 5.47152479e+00 -6.23630866e+00 1.33404374e+02
1716.lowfreq: -7.0119 -0.0009 -0.0008 -0.0005 2.6490 6.2406 34.7721 49.5764 67.6348
frequency: 34.7257 49.5439 67.6224 72.6185 78.7807 99.0096 107.5188 108.4130 116.0694 141.5292 160.1655 167.6247 175.5723 213.8083 215.6400 222.0715 239.1883 257.8183 264.1022 281.5999 295.5930 315.6612 335.5013 337.5678 350.1507 397.0362 415.2145 434.2698 448.9938 466.5091 509.5824 544.3990 580.4720 593.2344 598.8959 655.7309 675.8236 684.7488 706.8356 737.1843 739.4113 764.1112 770.6655 830.2945 833.2814 919.7217 933.0118 941.0074 951.5824 1001.3779 1027.6770 1037.9911 1039.5436 1041.4482 1043.2645 1073.4338 1131.3785 1194.7251 1197.8946 1201.6551 1231.1024 1239.4878 1258.6821 1277.0135 1331.9693 1350.0481 1368.2331 1372.9158 1384.0376 1385.4025 1388.8504 1391.9152 1412.3482 1413.3971 1418.1886 1456.9966 1460.7771 1461.2573 1473.1324 1474.1000 1492.9309 1495.6779 1498.0045 1509.0574 1534.5828 1558.1954 1573.6441 2985.3956 3002.2431 3007.6603 3009.2174 3010.9239 3083.6495 3085.7797 3087.5707 3092.0575 3096.3879 3098.5763 3125.1599 3127.7655 3130.7717 3139.7501
redmass: 5.8561 5.0747 4.1703 2.8795 3.5055 1.8165 1.5221 2.7265 6.0175 3.8566 8.1458 9.9468 2.9179 4.2561 1.7181 6.8994 3.0632 1.1195 2.1481 3.4050 12.3124 2.6004 2.0602 2.4182 4.1916 2.7248 2.7959 5.1980 5.0002 3.1112 5.4289 6.0753 2.6118 6.0935 8.3986 9.3555 7.6495 11.8804 9.4296 9.8539 11.8971 5.0604 5.7638 3.8338 9.3444 1.9421 1.8380 4.0304 1.2004 5.0645 1.3335 1.4028 1.4544 1.4995 1.4983 1.6103 10.8817 2.8158 2.8248 2.6797 10.9066 13.1992 12.6947 6.4849 9.2348 6.8937 3.9533 3.6085 5.3687 1.6183 1.7022 2.8134 1.1986 1.2041 1.2489 1.1473 1.0848 1.0992 1.0695 1.0560 1.0918 1.0784 1.0854 1.0474 1.0607 5.8082 8.7900 1.0348 1.0382 1.0384 1.0386 1.0396 1.0995 1.0999 1.0975 1.0981 1.0980 1.1012 1.0988 1.0984 1.0980 1.0977
irintensity: 0.6171 0.2800 0.4956 3.0316 0.8368 2.0842 2.4933 0.2101 0.8318 0.9979 3.9666 4.2037 1.9926 0.8576 0.0588 0.1073 1.1573 0.0579 0.1750 3.5205 0.0914 4.5796 0.5994 1.6316 3.2289 0.0663 0.3953 1.9562 2.8108 1.8283 0.8466 0.3623 1.5942 10.3000 9.6332 25.4845 1.8814 12.2568 4.8009 1.2550 1.0904 17.6153 1.3692 2.3164 9.9183 1.5960 3.3355 17.1789 0.0092 0.4298 0.9517 3.2612 3.3505 2.7370 0.4343 3.1204 0.6005 6.2395 3.4644 74.7902 142.6963 145.2484 0.4492 20.2857 0.5751 18.5881 160.7753 24.3994 113.6978 3.5502 45.5647 102.1278 17.3725 13.6345 25.6751 26.6268 5.5592 7.9671 12.8987 2.4388 18.9883 6.1870 22.4504 4.1130 27.5752 15.3858 6.1638 20.5450 8.6384 30.4905 2.3329 1.9675 12.2603 2.3278 4.0896 4.6300 55.7916 5.9634 5.7812 14.4845 13.4948 5.0148
temp: 298.150 k
press: 1.00000 atm
elementType: 8 8 8 8 8 8 7 7 7 6 6 6 6 6 6 6 6 6 6 6 6 1 1 1 1 1 1 1 1 1 1 1 1 1 1 1
symmnumber: 1
zpe: 700564.0 jmol-1
zpe.correction: 0.266831 hartree
zpe.thermalcorrener: 0.288526 hartree
zpe.thermalcorrenthalpy: 0.289470 hartree
zpe.thermalcorrgfe: 0.216696 hartree
zpe.sumelectzpe: -1080.019994 hartree
zpe.sumelectthermal: -1079.998299 hartree
zpe.sumelectthermalent: -1079.997355 hartree
zpe.sumelectthermalfe: -1080.070129 hartree
dipole: 1.4292 0.0600 -0.3705
dipole: 1.4776
quadrupole: -128.6440 -135.7620 -129.7301
quadrupole: 0.3520 -3.1345 1.4448
quadrupole: 2.7347 -4.3833 1.6486 0.3520 -3.1345 1.4448
hfenergy: -1080.2868248 hartree
pointgroup: C01 [X(C12H15N3O6)]
dipole: -0.5678342 -0.001019 -0.1245621 debye
polarizability: 213.9921417|1.5334532|191.9744309|-8.5339449|14.9714625|137.1574994 unknown
InChI: InChI=1S/C12H15N3O6/c1-6-9(13(16)17)7(2)11(15(20)21)8(12(3,4)5)10(6)14(18)19/h1-5H3
charge 0 multiplicity 1
36 atoms
O  -0.809406 -3.162895 -1.325615
O  -1.259237 2.681113 1.640206
O  -1.277436 -3.009229 0.900742
O  -0.864488 3.37532 -0.49565
O  4.020473 0.485271 0.855952
O  3.922319 -0.467649 -1.215545
N  -0.825714 -2.530434 -0.207123
N  -0.833775 2.493085 0.439389
N  3.372768 0.008871 -0.151276
C  -2.556034 0.000246 -0.009788
C  -0.986153 0.001563 -0.016848
C  -0.197207 -1.177968 -0.158137
C  -0.191668 1.178182 0.148124
C  -3.027677 -0.195659 1.467985
C  -3.165852 -1.134862 -0.89759
C  -3.174328 1.323567 -0.570949
C  1.220687 -1.233192 -0.215003
C  1.226213 1.237407 0.119687
C  1.887575 0.003685 -0.085397
C  1.960261 -2.548341 -0.370139
C  2.00768 2.522087 0.322133
H  -4.132927 -0.195748 1.49449
H  -2.670515 -1.156144 1.877457
H  -2.665588 0.622495 2.114243
H  -4.243434 -0.927774 -1.01308
H  -2.721988 -1.158021 -1.908533
H  -3.09821 -2.135767 -0.4485
H  -4.249481 1.143306 -0.740611
H  -3.116978 2.171964 0.125733
H  -2.729292 1.616158 -1.538003
H  1.473828 -3.352617 0.206796
H  1.973049 -2.858066 -1.429763
H  3.004631 -2.475547 -0.034619
H  2.841287 2.595616 -0.397084
H  1.385437 3.418134 0.197288
H  2.456281 2.535341 1.330629
