program: Orca
programVersion: 5.0.2
elementType: O O O O N C C C C C C C C C C C C C C C C C C C H H H H H H H H H H H H H H H H H H H H H H H H H
charge: 0
multiplicity: 1
keywords: wb97x-d3
keywords: def2-TZVPP
keywords: def2/J RIJCOSX
keywords: DEFGRID2
keywords: scfconv7
keywords: smallprint printgap noloewdin
keywords: NOSOSCF
formula: C19H25NO4
InChI: InChI=1/C19H25NO4/c1-11(2)9-14-15(19(14,3)4)18(23)24-10-20-16(21)12-7-5-6-8-13(12)17(20)22/h9,14-15H,5-8,10H2,1-4H3
49 atoms
O  -0.4902 1.490011 0.824008
O  -1.384779 2.313139 -1.061891
O  1.268268 0.341949 -1.62443
O  2.732024 1.28285 2.571271
N  1.779716 1.141444 0.474339
C  -4.042244 1.176996 0.190011
C  -3.529317 0.262169 -0.865777
C  -2.591879 0.7128 0.24112
C  -4.377526 2.602642 -0.17113
C  -4.925019 0.617874 1.279778
C  -3.935864 -1.164325 -0.960146
C  -1.463976 1.59367 -0.097082
C  -3.131778 -2.162232 -1.336391
C  0.75631 2.128618 0.589813
C  -3.625535 -3.574126 -1.417753
C  -1.689252 -1.966656 -1.68973
C  3.038188 -0.631359 -0.285868
C  3.473168 -0.346187 0.942137
C  3.574682 -1.707855 -1.153735
C  4.590989 -1.033557 1.632917
C  4.460872 -2.638467 -0.323635
C  5.380277 -1.862776 0.618439
C  1.932778 0.300688 -0.620293
C  2.661688 0.772138 1.483699
H  -3.33058 0.747831 -1.818646
H  -2.37493 -0.017875 1.011858
H  -5.432356 2.6716 -0.444894
H  -4.214996 3.271712 0.676273
H  -3.800724 2.979307 -1.012664
H  -5.969912 0.606887 0.962111
H  -4.653052 -0.399862 1.560836
H  -4.862095 1.23503 2.178072
H  -4.971901 -1.39369 -0.725942
H  0.978916 2.761009 1.446608
H  0.727824 2.745377 -0.305832
H  -4.670282 -3.663981 -1.119816
H  -3.529307 -3.967137 -2.433296
H  -3.034699 -4.23314 -0.775762
H  -1.45597 -2.452769 -2.640249
H  -1.40553 -0.919835 -1.775871
H  -1.039861 -2.429316 -0.940884
H  2.756401 -2.261036 -1.621059
H  4.143068 -1.260855 -1.975658
H  5.236552 -0.304145 2.127946
H  4.190553 -1.669621 2.428798
H  3.827578 -3.310853 0.262062
H  5.052071 -3.268493 -0.989548
H  6.021038 -1.197694 0.0324
H  6.043717 -2.550241 1.144914
elementType: O N C H
totalener: -1094.87849849 hartree
nucrepener: 2112.83915140 hartree
electener: -3207.71764989 hartree
oneelecener: -5688.04319096 hartree
twoeener: 2480.32554107 hartree
cpcmener: -0.03058544 hartree
kineticenergy: 1090.04534365 hartree
xcener: -105.971853184690 hartree
chargesum: 0.0000000
charge: -0.284066 -0.458207 -0.413546 -0.409557 -0.096073 0.151204 -0.013387 -0.109350 -0.279012 -0.284466 -0.301699 0.387797 -0.005321 0.080151 -0.228359 -0.239553 -0.056316 -0.083873 -0.071300 -0.073455 -0.133954 -0.135850 0.313655 0.325200 0.103611 0.094124 0.094009 0.098458 0.093937 0.098219 0.092612 0.098065 0.121467 0.124095 0.139674 0.089112 0.096114 0.093482 0.100551 0.074917 0.100838 0.093951 0.101028 0.093819 0.100991 0.077779 0.080134 0.077536 0.080815
qa: -0.2841 -0.4582 -0.4135 -0.4096 -0.0961 0.1512 -0.0134 -0.1094 -0.2790 -0.2845 -0.3017 0.3878 -0.0053 0.0802 -0.2284 -0.2396 -0.0563 -0.0839 -0.0713 -0.0735 -0.1340 -0.1358 0.3137 0.3252 0.1036 0.0941 0.0940 0.0985 0.0939 0.0982 0.0926 0.0981 0.1215 0.1241 0.1397 0.0891 0.0961 0.0935 0.1006 0.0749 0.1008 0.0940 0.1010 0.0938 0.1010 0.0778 0.0801 0.0775 0.0808
va: 2.1040 2.0485 2.0973 2.1097 3.1008 3.6994 3.8104 3.7921 3.8941 3.9091 3.8977 4.1632 3.7071 3.8614 3.9318 3.9437 3.6686 3.6974 3.9215 3.9188 3.9128 3.9150 4.2047 4.2225 1.0271 1.0321 1.0010 0.9993 1.0178 1.0000 1.0017 1.0030 1.0039 1.0154 1.0173 1.0062 0.9963 0.9962 1.0014 1.0148 0.9972 1.0144 1.0052 1.0156 1.0052 1.0069 1.0097 1.0071 1.0097
dispcorr: -0.023951294 hartree
energy: -1094.902449778876
dipole: -14.87144 15.87786 1.00643 -17.15628 15.34621 -1.81007 -3.72168 4.23125 0.50957
magnitude: 2.13282 au
magnitude: 5.42119 debye
