program: Orca
programVersion: 5.0.2
elementType: O O O O N C C C C C C C C C C C C C C C C C C C H H H H H H H H H H H H H H H H H H H H H H H H H
charge: 0
multiplicity: 1
keywords: wb97x-d3
keywords: def2-TZVPP
keywords: def2/J RIJCOSX
keywords: DEFGRID2
keywords: scfconv7
keywords: smallprint printgap noloewdin
keywords: NOSOSCF
formula: C19H25NO4
InChI: InChI=1/C19H25NO4/c1-11(2)9-14-15(19(14,3)4)18(23)24-10-20-16(21)12-7-5-6-8-13(12)17(20)22/h9,14-15H,5-8,10H2,1-4H3
49 atoms
O  -0.604746 1.536114 1.403863
O  -0.306102 -0.679151 1.352231
O  2.715691 -0.388617 2.118436
O  1.191553 2.82308 -0.715927
N  1.710082 1.355125 0.982785
C  -2.371333 0.006144 -1.058997
C  -2.86516 -1.016863 -0.082147
C  -2.296393 0.284969 0.433044
C  -1.105091 -0.283038 -1.829365
C  -3.353034 0.848897 -1.834454
C  -4.298353 -1.349347 0.09098
C  -0.984963 0.286933 1.108166
C  -4.777335 -2.248259 0.956224
C  0.702817 1.738698 1.921271
C  -6.240891 -2.56472 1.017672
C  -3.927279 -3.014247 1.923143
C  3.272404 0.121524 -0.176903
C  2.841883 1.074536 -1.004033
C  4.279788 -0.912635 -0.517086
C  3.311779 1.273975 -2.396523
C  4.477608 -0.946868 -2.033683
C  4.584858 0.457711 -2.626134
C  2.569501 0.268075 1.121748
C  1.82235 1.886907 -0.295326
H  -2.188793 -1.856405 0.044568
H  -2.99263 1.035127 0.793283
H  -0.581319 0.64242 -2.08008
H  -0.410999 -0.926885 -1.290539
H  -1.346966 -0.78512 -2.768324
H  -3.702724 0.318382 -2.72274
H  -4.227154 1.132122 -1.24854
H  -2.875526 1.771783 -2.169397
H  -5.006832 -0.836688 -0.552701
H  0.862475 1.189263 2.849054
H  0.758068 2.804532 2.12937
H  -6.817159 -2.001587 0.28346
H  -6.418422 -3.628839 0.838894
H  -6.650777 -2.347372 2.007706
H  -4.319656 -2.91264 2.93783
H  -3.942762 -4.083166 1.695471
H  -2.887779 -2.692025 1.942696
H  5.221549 -0.6845 -0.007525
H  3.963982 -1.888729 -0.141539
H  2.521623 0.965289 -3.089196
H  3.485704 2.334656 -2.593035
H  5.371717 -1.524539 -2.272838
H  3.634402 -1.470592 -2.493584
H  4.793551 0.399107 -3.695295
H  5.432508 0.977871 -2.170578
elementType: O N C H
totalener: -1094.87758275 hartree
nucrepener: 2145.05042129 hartree
electener: -3239.92800404 hartree
oneelecener: -5752.60085169 hartree
twoeener: 2512.67284765 hartree
cpcmener: -0.03183820 hartree
kineticenergy: 1090.04675148 hartree
xcener: -105.972437821690 hartree
chargesum: -0.0000000
charge: -0.275705 -0.450212 -0.400265 -0.408327 -0.096649 0.152693 -0.053987 -0.066693 -0.275018 -0.301451 -0.257604 0.379831 -0.025330 0.082543 -0.232435 -0.254821 -0.036376 -0.090017 -0.074231 -0.066407 -0.135415 -0.138021 0.299363 0.293030 0.100640 0.099044 0.091308 0.091355 0.104859 0.103963 0.088399 0.100119 0.121117 0.133040 0.143535 0.087783 0.093305 0.094269 0.093914 0.098019 0.080998 0.100169 0.093613 0.099906 0.094090 0.080777 0.078597 0.081097 0.077588
qa: -0.2757 -0.4502 -0.4003 -0.4083 -0.0966 0.1527 -0.0540 -0.0667 -0.2750 -0.3015 -0.2576 0.3798 -0.0253 0.0825 -0.2324 -0.2548 -0.0364 -0.0900 -0.0742 -0.0664 -0.1354 -0.1380 0.2994 0.2930 0.1006 0.0990 0.0913 0.0914 0.1049 0.1040 0.0884 0.1001 0.1211 0.1330 0.1435 0.0878 0.0933 0.0943 0.0939 0.0980 0.0810 0.1002 0.0936 0.0999 0.0941 0.0808 0.0786 0.0811 0.0776
va: 2.1193 2.0494 2.1155 2.1002 3.0642 3.7627 3.8437 3.8019 3.8801 3.9096 3.8907 4.2054 3.7189 3.8943 3.9307 3.9429 3.6185 3.6939 3.9145 3.9183 3.9139 3.9182 4.2185 4.1966 1.0193 1.0283 1.0088 1.0132 1.0017 0.9983 1.0022 1.0020 1.0064 1.0151 0.9922 1.0078 0.9950 0.9961 0.9980 0.9973 1.0202 1.0044 1.0159 1.0063 1.0157 1.0095 1.0073 1.0094 1.0063
dispcorr: -0.025074743 hartree
energy: -1094.902657494018
dipole: -17.21482 17.55906 0.34424 -13.73615 13.80003 0.06388 -13.06581 11.73190 -1.33390
magnitude: 1.37909 au
magnitude: 3.50536 debye
