program: Orca
programVersion: 5.0.2
elementType: O O O O N C C C C C C C C C C C C C C C C C C C H H H H H H H H H H H H H H H H H H H H H H H H H
charge: 0
multiplicity: 1
keywords: wb97x-d3
keywords: def2-TZVPP
keywords: def2/J RIJCOSX
keywords: DEFGRID2
keywords: scfconv7
keywords: smallprint printgap noloewdin
keywords: NOSOSCF
formula: C19H25NO4
InChI: InChI=1/C19H25NO4/c1-11(2)9-14-15(19(14,3)4)18(23)24-10-20-16(21)12-7-5-6-8-13(12)17(20)22/h9,14-15H,5-8,10H2,1-4H3
49 atoms
O  -0.532386 1.25193 0.631776
O  -1.709917 2.573274 1.988543
O  2.0529 1.722899 -1.588875
O  1.931702 -0.095318 2.571744
N  1.758349 1.109373 0.614067
C  -3.486999 1.053224 -0.580455
C  -2.838963 -0.24942 -0.197518
C  -2.855435 0.885753 0.79016
C  -2.811401 1.911853 -1.620694
C  -4.991898 1.14171 -0.613102
C  -3.630937 -1.46873 0.097619
C  -1.664164 1.657958 1.200761
C  -3.787087 -2.508146 -0.726818
C  0.668716 1.947401 0.964765
C  -4.591307 -3.706057 -0.321828
C  -3.198353 -2.57677 -2.101767
C  3.362054 -0.042064 -0.569747
C  3.326707 -0.575332 0.652412
C  4.266664 -0.476059 -1.661752
C  4.197231 -1.675355 1.132123
C  4.885481 -1.828588 -1.303218
C  5.35293 -1.875733 0.150475
C  2.343806 1.035394 -0.644864
C  2.282934 0.121575 1.441313
H  -1.88621 -0.426816 -0.686451
H  -3.574002 0.810172 1.600724
H  -1.728749 1.790327 -1.640163
H  -3.182468 1.652738 -2.614498
H  -3.026958 2.970051 -1.457332
H  -5.377919 0.771548 -1.565562
H  -5.462692 0.561489 0.180095
H  -5.320488 2.177219 -0.503651
H  -4.117324 -1.509423 1.067997
H  0.71263 2.165967 2.030709
H  0.728123 2.881955 0.407271
H  -3.98191 -4.613223 -0.3426
H  -5.006677 -3.604379 0.68043
H  -5.419567 -3.876424 -1.014391
H  -3.986857 -2.705344 -2.84776
H  -2.629815 -1.689785 -2.375859
H  -2.539065 -3.442622 -2.201864
H  3.722669 -0.533424 -2.607537
H  5.044575 0.280411 -1.807503
H  4.569969 -1.454926 2.135247
H  3.603486 -2.590197 1.227292
H  4.147308 -2.617743 -1.472201
H  5.722008 -2.03583 -1.971935
H  6.103467 -1.097392 0.315007
H  5.843027 -2.828683 0.354294
elementType: O N C H
totalener: -1094.87840448 hartree
nucrepener: 2085.24451413 hartree
electener: -3180.12291860 hartree
oneelecener: -5632.20140199 hartree
twoeener: 2452.07848338 hartree
cpcmener: -0.03141418 hartree
kineticenergy: 1090.05330824 hartree
xcener: -105.971328952030 hartree
chargesum: 0.0000000
charge: -0.267842 -0.462905 -0.412578 -0.407356 -0.111623 0.137751 0.031516 -0.153104 -0.281898 -0.268633 -0.279890 0.418113 -0.032257 0.073916 -0.228715 -0.251234 -0.062232 -0.073420 -0.072053 -0.072724 -0.135020 -0.136104 0.316827 0.318580 0.100173 0.096294 0.084562 0.095125 0.101524 0.094325 0.090111 0.098739 0.118937 0.129020 0.140348 0.093954 0.088741 0.093334 0.095783 0.086986 0.097780 0.093154 0.100629 0.093933 0.101662 0.078246 0.080579 0.077906 0.081041
qa: -0.2678 -0.4629 -0.4126 -0.4074 -0.1116 0.1378 0.0315 -0.1531 -0.2819 -0.2686 -0.2799 0.4181 -0.0323 0.0739 -0.2287 -0.2512 -0.0622 -0.0734 -0.0721 -0.0727 -0.1350 -0.1361 0.3168 0.3186 0.1002 0.0963 0.0846 0.0951 0.1015 0.0943 0.0901 0.0987 0.1189 0.1290 0.1403 0.0940 0.0887 0.0933 0.0958 0.0870 0.0978 0.0932 0.1006 0.0939 0.1017 0.0782 0.0806 0.0779 0.0810
va: 2.0993 2.0397 2.0990 2.1092 3.1365 3.7020 3.7441 3.9342 3.9021 3.9017 3.8635 4.1578 3.7090 3.8742 3.9283 3.9426 3.6921 3.6689 3.9205 3.9209 3.9147 3.9145 4.2048 4.2173 1.0169 1.0326 1.0176 1.0017 1.0012 1.0027 1.0028 1.0030 1.0081 1.0125 1.0022 0.9954 1.0081 0.9962 0.9976 1.0090 0.9980 1.0157 1.0044 1.0152 1.0051 1.0068 1.0095 1.0068 1.0096
dispcorr: -0.022910102 hartree
energy: -1094.901314577324
dipole: -15.75910 16.99913 1.24003 -17.48187 15.67666 -1.80521 -14.40532 12.91327 -1.49204
magnitude: 2.65003 au
magnitude: 6.73584 debye
