program: Orca
programVersion: 5.0.2
elementType: O O O O N C C C C C C C C C C C C C C C C C C C H H H H H H H H H H H H H H H H H H H H H H H H H
charge: 0
multiplicity: 1
keywords: wb97x-d3
keywords: def2-TZVPP
keywords: def2/J RIJCOSX
keywords: DEFGRID2
keywords: scfconv7
keywords: smallprint printgap noloewdin
keywords: NOSOSCF
formula: C19H25NO4
InChI: InChI=1/C19H25NO4/c1-11(2)9-14-15(19(14,3)4)18(23)24-10-20-16(21)12-7-5-6-8-13(12)17(20)22/h9,14-15H,5-8,10H2,1-4H3
49 atoms
O  -0.610217 1.115912 0.76665
O  -1.839716 2.594066 1.889819
O  1.96321 2.172751 -1.108605
O  1.877897 -0.771588 2.349628
N  1.674054 0.939232 0.816409
C  -3.063523 1.016611 -1.129118
C  -2.938594 -0.221303 -0.293524
C  -2.938171 1.142382 0.379799
C  -1.916179 1.391541 -2.036123
C  -4.405124 1.404429 -1.705111
C  -4.057318 -1.148884 -0.042504
C  -1.766468 1.697977 1.080695
C  -3.929553 -2.467379 0.136505
C  0.571472 1.639003 1.371623
C  -5.125649 -3.333638 0.386575
C  -2.600554 -3.176113 0.097204
C  3.299816 0.207204 -0.641812
C  3.268543 -0.661262 0.36989
C  4.22649 0.137615 -1.798083
C  4.141228 -1.8536 0.499087
C  5.353946 -0.848978 -1.488738
C  4.832115 -2.12948 -0.838137
C  2.263028 1.241852 -0.406787
C  2.217203 -0.235259 1.327087
H  -1.962972 -0.691098 -0.351148
H  -3.860115 1.422629 0.877824
H  -0.951222 1.026714 -1.692913
H  -2.084509 0.968856 -3.028748
H  -1.844937 2.474846 -2.151241
H  -5.233623 1.234346 -1.018586
H  -4.413104 2.464936 -1.964853
H  -4.609291 0.841203 -2.618215
H  -5.05224 -0.717028 0.009721
H  0.552971 1.48566 2.450141
H  0.673228 2.704059 1.165186
H  -5.206681 -4.120304 -0.368977
H  -5.045943 -3.843556 1.350824
H  -6.056557 -2.766242 0.381944
H  -1.872779 -2.731314 0.778238
H  -2.704263 -4.224052 0.379193
H  -2.156692 -3.157927 -0.900739
H  3.670549 -0.174384 -2.688279
H  4.625663 1.128726 -2.026381
H  4.878666 -1.67681 1.288606
H  3.557547 -2.718745 0.822729
H  5.891098 -1.088223 -2.407451
H  6.075985 -0.371923 -0.820089
H  5.652141 -2.83274 -0.686743
H  4.124403 -2.616796 -1.515115
elementType: O N C H
totalener: -1094.87842830 hartree
nucrepener: 2099.42546338 hartree
electener: -3194.30389167 hartree
oneelecener: -5660.44730530 hartree
twoeener: 2466.14341363 hartree
cpcmener: -0.03146252 hartree
kineticenergy: 1090.03025646 hartree
xcener: -105.968333264136 hartree
chargesum: -0.0000000
charge: -0.271138 -0.466290 -0.410056 -0.408193 -0.105207 0.092626 0.070818 -0.093134 -0.265682 -0.281511 -0.315410 0.404587 -0.000287 0.072604 -0.226006 -0.289188 -0.052356 -0.076805 -0.073616 -0.071264 -0.135530 -0.135509 0.301436 0.318523 0.097191 0.089766 0.080426 0.095895 0.100523 0.090161 0.097293 0.097591 0.114305 0.131525 0.133677 0.097557 0.095713 0.084478 0.100016 0.095593 0.105548 0.101753 0.094354 0.100867 0.093934 0.081108 0.078342 0.080776 0.078200
qa: -0.2711 -0.4663 -0.4101 -0.4082 -0.1052 0.0926 0.0708 -0.0931 -0.2657 -0.2815 -0.3154 0.4046 -0.0003 0.0726 -0.2260 -0.2892 -0.0524 -0.0768 -0.0736 -0.0713 -0.1355 -0.1355 0.3014 0.3185 0.0972 0.0898 0.0804 0.0959 0.1005 0.0902 0.0973 0.0976 0.1143 0.1315 0.1337 0.0976 0.0957 0.0845 0.1000 0.0956 0.1055 0.1018 0.0944 0.1009 0.0939 0.0811 0.0783 0.0808 0.0782
va: 2.1000 2.0382 2.1000 2.1082 3.1304 3.7093 3.7310 3.8490 3.9146 3.9194 3.9131 4.1613 3.6928 3.8975 3.9235 3.9434 3.6764 3.6907 3.9207 3.9194 3.9157 3.9159 4.1987 4.2026 1.0170 1.0316 1.0126 1.0010 1.0005 1.0072 1.0011 1.0008 1.0125 1.0049 1.0017 0.9923 0.9929 1.0100 0.9982 1.0046 0.9947 1.0049 1.0151 1.0048 1.0155 1.0096 1.0069 1.0095 1.0066
dispcorr: -0.023007276 hartree
energy: -1094.901435573575
dipole: -12.59748 14.03583 1.43835 -16.95509 15.17237 -1.78272 -13.91161 12.34190 -1.56971
magnitude: 2.77686 au
magnitude: 7.05821 debye
