program: Orca
programVersion: 5.0.2
elementType: O O O O N C C C C C C C C C C C C C C C C C C C H H H H H H H H H H H H H H H H H H H H H H H H H
charge: 0
multiplicity: 1
keywords: wb97x-d3
keywords: def2-TZVPP
keywords: def2/J RIJCOSX
keywords: DEFGRID2
keywords: scfconv7
keywords: smallprint printgap noloewdin
keywords: NOSOSCF
formula: C19H25NO4
InChI: InChI=1/C19H25NO4/c1-11(2)9-14-15(19(14,3)4)18(23)24-10-20-16(21)12-7-5-6-8-13(12)17(20)22/h9,14-15H,5-8,10H2,1-4H3
49 atoms
O  -0.280648 1.358761 0.774081
O  -1.349441 1.996125 -1.093747
O  1.60111 0.335624 -1.652226
O  2.934723 1.631809 2.492505
N  2.009615 1.283463 0.406153
C  -3.770548 0.709088 0.488585
C  -3.340327 -0.167472 -0.647972
C  -2.304405 0.32998 0.332388
C  -4.237003 2.110963 0.187147
C  -4.48525 0.082948 1.660995
C  -3.652724 -1.615986 -0.695299
C  -1.294087 1.309978 -0.10373
C  -4.543121 -2.188737 -1.510432
C  0.870371 2.137929 0.474679
C  -4.768398 -3.67028 -1.491299
C  -5.385922 -1.434285 -2.492137
C  3.462524 -0.3709 -0.27119
C  3.862495 0.025102 0.938151
C  4.109809 -1.432651 -1.079634
C  5.045725 -0.501923 1.660668
C  5.077637 -2.223798 -0.19793
C  5.91478 -1.30795 0.693456
C  2.260638 0.413067 -0.64766
C  2.925628 1.067111 1.429266
H  -3.319027 0.336618 -1.609459
H  -1.945764 -0.38899 1.061326
H  -4.004677 2.789125 1.011233
H  -3.802795 2.52393 -0.721186
H  -5.321446 2.114949 0.058158
H  -5.549442 -0.029986 1.442715
H  -4.0950 -0.902402 1.913971
H  -4.395393 0.712493 2.548492
H  -3.105979 -2.254233 -0.006815
H  1.015613 2.853405 1.281445
H  0.753667 2.680105 -0.46143
H  -4.571617 -4.110215 -2.472952
H  -4.132094 -4.175492 -0.764452
H  -5.80847 -3.906983 -1.250961
H  -5.200199 -1.780149 -3.512818
H  -6.447297 -1.610938 -2.297402
H  -5.223755 -0.357778 -2.469193
H  3.353547 -2.089172 -1.517082
H  4.636832 -0.977283 -1.924366
H  5.614772 0.318075 2.105667
H  4.712042 -1.125061 2.49686
H  4.509244 -2.917568 0.428474
H  5.729236 -2.83277 -0.826167
H  6.488075 -0.618793 0.066444
H  6.641634 -1.894294 1.257481
elementType: O N C H
totalener: -1094.87951662 hartree
nucrepener: 2056.02651970 hartree
electener: -3150.90603631 hartree
oneelecener: -5574.43138494 hartree
twoeener: 2423.52534862 hartree
cpcmener: -0.03188894 hartree
kineticenergy: 1090.03486115 hartree
xcener: -105.969450341570 hartree
chargesum: -0.0000000
charge: -0.282381 -0.457004 -0.407977 -0.409817 -0.100696 0.147629 0.004161 -0.152512 -0.289018 -0.260972 -0.267251 0.422971 -0.031847 0.079916 -0.228272 -0.251373 -0.059688 -0.083682 -0.071252 -0.073325 -0.134152 -0.135349 0.313720 0.323603 0.096049 0.092580 0.099651 0.093266 0.095051 0.095787 0.089214 0.098127 0.118669 0.124914 0.139581 0.094487 0.088770 0.093176 0.097391 0.094830 0.088177 0.094121 0.099882 0.093792 0.101414 0.077862 0.079769 0.077554 0.080454
qa: -0.2824 -0.4570 -0.4080 -0.4098 -0.1007 0.1476 0.0042 -0.1525 -0.2890 -0.2610 -0.2673 0.4230 -0.0318 0.0799 -0.2283 -0.2514 -0.0597 -0.0837 -0.0713 -0.0733 -0.1342 -0.1353 0.3137 0.3236 0.0960 0.0926 0.0997 0.0933 0.0951 0.0958 0.0892 0.0981 0.1187 0.1249 0.1396 0.0945 0.0888 0.0932 0.0974 0.0948 0.0882 0.0941 0.0999 0.0938 0.1014 0.0779 0.0798 0.0776 0.0805
va: 2.1091 2.0572 2.1101 2.1088 3.0979 3.6783 3.7678 3.8808 3.9056 3.9047 3.8765 4.1775 3.7116 3.8598 3.9264 3.9448 3.6580 3.6912 3.9207 3.9207 3.9139 3.9128 4.2271 4.2263 1.0277 1.0381 0.9994 1.0172 1.0010 1.0032 1.0031 1.0029 1.0084 1.0135 1.0184 0.9953 1.0081 0.9963 0.9977 0.9975 1.0083 1.0154 1.0053 1.0155 1.0054 1.0069 1.0099 1.0070 1.0096
dispcorr: -0.022304315 hartree
energy: -1094.901820933451
dipole: -21.95688 22.80506 0.84818 -16.78881 15.26857 -1.52024 -3.50769 4.07966 0.57197
magnitude: 1.83240 au
magnitude: 4.65759 debye
