program: Orca
programVersion: 5.0.2
elementType: O O O O N C C C C C C C C C C C C C C C C C C C H H H H H H H H H H H H H H H H H H H H H H H H H
charge: 0
multiplicity: 1
keywords: wb97x-d3
keywords: def2-TZVPP
keywords: def2/J RIJCOSX
keywords: DEFGRID2
keywords: scfconv7
keywords: smallprint printgap noloewdin
keywords: NOSOSCF
formula: C19H25NO4
InChI: InChI=1/C19H25NO4/c1-11(2)9-14-15(19(14,3)4)18(23)24-10-20-16(21)12-7-5-6-8-13(12)17(20)22/h9,14-15H,5-8,10H2,1-4H3
49 atoms
O  -0.536564 1.688776 1.446056
O  -0.415918 -0.543884 1.40911
O  1.473536 2.63047 -0.619952
O  2.537157 -0.479237 2.520872
N  1.776311 1.265499 1.21161
C  -2.298981 0.253406 -1.098852
C  -2.962892 -0.664118 -0.107381
C  -2.268573 0.580095 0.384199
C  -1.044444 -0.221699 -1.790196
C  -3.142756 1.153882 -1.965774
C  -4.429874 -0.778648 0.013153
C  -1.001334 0.473192 1.131869
C  -5.10453 -1.93185 0.021238
C  0.745051 1.789808 2.050384
C  -6.595677 -1.956631 0.161261
C  -4.429647 -3.273643 -0.098805
C  2.983253 0.739361 -0.677826
C  3.289233 -0.176179 0.241829
C  3.539475 0.792373 -2.051277
C  4.234072 -1.301865 0.041563
C  4.756343 -0.129622 -2.144892
C  4.512538 -1.470837 -1.453306
C  2.000177 1.683405 -0.093619
C  2.521227 0.119297 1.477628
H  -2.414173 -1.582813 0.07448
H  -2.893209 1.417641 0.678539
H  -0.46334 -0.924349 -1.194336
H  -1.303844 -0.728079 -2.722287
H  -0.396862 0.620079 -2.046572
H  -2.557337 2.007063 -2.314214
H  -3.495296 0.614434 -2.847489
H  -4.016417 1.546851 -1.447363
H  -4.988209 0.147946 0.109012
H  0.780759 1.273639 3.009943
H  0.889039 2.854572 2.21815
H  -7.019121 -0.956068 0.252399
H  -7.063115 -2.443812 -0.698899
H  -6.898807 -2.531306 1.040909
H  -5.160867 -4.080276 -0.151227
H  -3.807037 -3.344802 -0.992405
H  -3.784223 -3.483672 0.757172
H  2.765002 0.486859 -2.76283
H  3.802946 1.818784 -2.317668
H  5.160771 -1.097291 0.587825
H  3.828661 -2.221041 0.47091
H  5.01356 -0.290172 -3.192525
H  5.616683 0.363383 -1.683738
H  5.373453 -2.125939 -1.593248
H  3.659783 -1.970077 -1.922379
elementType: O N C H
totalener: -1094.87738366 hartree
nucrepener: 2140.57920980 hartree
electener: -3235.45659345 hartree
oneelecener: -5743.68376939 hartree
twoeener: 2508.22717594 hartree
cpcmener: -0.03218671 hartree
kineticenergy: 1090.04462887 hartree
xcener: -105.971934511478 hartree
chargesum: -0.0000000
charge: -0.272686 -0.448048 -0.408647 -0.400901 -0.099646 0.123683 0.034732 -0.111878 -0.279983 -0.272195 -0.303960 0.380213 -0.011789 0.086069 -0.221751 -0.284396 -0.087462 -0.034583 -0.066075 -0.073774 -0.137389 -0.136084 0.294471 0.297376 0.091934 0.096098 0.090644 0.103878 0.090711 0.099022 0.097611 0.087858 0.117052 0.133597 0.142575 0.084397 0.095701 0.097262 0.094677 0.103987 0.103705 0.099763 0.093701 0.099344 0.093232 0.080816 0.077430 0.080741 0.078966
qa: -0.2727 -0.4480 -0.4086 -0.4009 -0.0996 0.1237 0.0347 -0.1119 -0.2800 -0.2722 -0.3040 0.3802 -0.0118 0.0861 -0.2218 -0.2844 -0.0875 -0.0346 -0.0661 -0.0738 -0.1374 -0.1361 0.2945 0.2974 0.0919 0.0961 0.0906 0.1039 0.0907 0.0990 0.0976 0.0879 0.1171 0.1336 0.1426 0.0844 0.0957 0.0973 0.0947 0.1040 0.1037 0.0998 0.0937 0.0993 0.0932 0.0808 0.0774 0.0807 0.0790
va: 2.1171 2.0626 2.0996 2.1156 3.0684 3.7035 3.7901 3.8294 3.9009 3.9046 3.8868 4.2368 3.6957 3.8872 3.9209 3.9400 3.6958 3.6220 3.9167 3.9130 3.9181 3.9143 4.1951 4.2173 1.0278 1.0326 1.0150 1.0020 1.0095 1.0023 1.0016 1.0055 1.0094 1.0148 0.9915 1.0102 0.9931 0.9929 1.0048 0.9953 0.9968 1.0062 1.0161 1.0042 1.0160 1.0094 1.0062 1.0096 1.0070
dispcorr: -0.024877314 hartree
energy: -1094.902260970334
dipole: -17.96695 18.40075 0.43380 -13.93974 13.85141 -0.08833 -17.64390 16.22594 -1.41797
magnitude: 1.48547 au
magnitude: 3.77575 debye
