program: Orca
programVersion: 5.0.2
elementType: O O O O N C C C C C C C C C C C C C C C C C C C H H H H H H H H H H H H H H H H H H H H H H H H H
charge: 0
multiplicity: 1
keywords: wb97x-d3
keywords: def2-TZVPP
keywords: def2/J RIJCOSX
keywords: DEFGRID2
keywords: scfconv7
keywords: smallprint printgap noloewdin
keywords: NOSOSCF
formula: C19H25NO4
InChI: InChI=1/C19H25NO4/c1-11(2)9-14-15(19(14,3)4)18(23)24-10-20-16(21)12-7-5-6-8-13(12)17(20)22/h9,14-15H,5-8,10H2,1-4H3
49 atoms
O  -0.406897 0.920631 -0.596949
O  -1.818067 2.001003 0.767427
O  2.837544 1.348122 -2.243535
O  1.420225 0.500621 1.986351
N  1.843058 1.192273 -0.167972
C  -2.763776 -1.003152 1.17168
C  -3.792662 -0.201353 0.447751
C  -2.366281 -0.180375 -0.04963
C  -2.331247 -0.571632 2.550953
C  -2.727629 -2.499532 0.978831
C  -4.859156 -0.847675 -0.361863
C  -1.543852 1.031597 0.10322
C  -5.327508 -0.39803 -1.528771
C  0.621708 1.884626 -0.406151
C  -6.415949 -1.121643 -2.261132
C  -4.823123 0.840676 -2.202111
C  3.849579 0.097582 -0.434851
C  3.435364 -0.155014 0.807662
C  5.125336 -0.379832 -1.021704
C  4.167754 -0.975303 1.802563
C  6.044301 -0.87075 0.098098
C  5.297117 -1.740386 1.10795
C  2.831934 0.940328 -1.111237
C  2.128796 0.518082 1.012333
H  -4.090645 0.710415 0.961052
H  -2.14826 -0.763549 -0.937649
H  -2.445936 0.496916 2.721428
H  -2.935128 -1.085207 3.30198
H  -1.286909 -0.83233 2.735724
H  -3.001306 -2.800784 -0.032513
H  -1.726506 -2.886659 1.17827
H  -3.413657 -2.993523 1.670364
H  -5.303245 -1.747116 0.056842
H  0.39788 2.542852 0.430898
H  0.724005 2.48323 -1.309608
H  -7.288086 -0.479155 -2.407886
H  -6.082887 -1.421313 -3.258544
H  -6.742657 -2.017543 -1.732994
H  -5.643551 1.542282 -2.373899
H  -4.057137 1.362142 -1.630909
H  -4.408991 0.607632 -3.186766
H  4.91806 -1.18423 -1.734677
H  5.601236 0.417029 -1.597816
H  4.564793 -0.320893 2.585306
H  3.483253 -1.662163 2.306231
H  6.87811 -1.428366 -0.330794
H  6.476424 -0.007271 0.61209
H  5.990783 -2.124632 1.857102
H  4.879909 -2.61081 0.593751
elementType: O N C H
totalener: -1094.87831338 hartree
nucrepener: 2081.52493119 hartree
electener: -3176.40324457 hartree
oneelecener: -5625.31101259 hartree
twoeener: 2448.90776802 hartree
cpcmener: -0.02946160 hartree
kineticenergy: 1090.04520585 hartree
xcener: -105.971326135401 hartree
chargesum: 0.0000000
charge: -0.279242 -0.457146 -0.408818 -0.415016 -0.096495 0.150823 -0.007086 -0.124156 -0.279517 -0.286083 -0.293227 0.388360 -0.018556 0.078555 -0.227720 -0.238161 -0.083877 -0.055551 -0.075245 -0.068815 -0.132552 -0.137722 0.325917 0.312381 0.103869 0.098942 0.094346 0.097244 0.093695 0.093334 0.098371 0.098531 0.120693 0.139714 0.125108 0.095548 0.093586 0.088892 0.100950 0.081731 0.097626 0.101638 0.093291 0.100352 0.094372 0.080285 0.077811 0.080575 0.078444
qa: -0.2792 -0.4571 -0.4088 -0.4150 -0.0965 0.1508 -0.0071 -0.1242 -0.2795 -0.2861 -0.2932 0.3884 -0.0186 0.0786 -0.2277 -0.2382 -0.0839 -0.0556 -0.0752 -0.0688 -0.1326 -0.1377 0.3259 0.3124 0.1039 0.0989 0.0943 0.0972 0.0937 0.0933 0.0984 0.0985 0.1207 0.1397 0.1251 0.0955 0.0936 0.0889 0.1009 0.0817 0.0976 0.1016 0.0933 0.1004 0.0944 0.0803 0.0778 0.0806 0.0784
va: 2.1031 2.0501 2.1096 2.0961 3.0967 3.7074 3.8108 3.8198 3.8908 3.9062 3.8892 4.1560 3.7156 3.8603 3.9298 3.9334 3.6978 3.6635 3.9204 3.9179 3.9119 3.9167 4.2215 4.2113 1.0254 1.0284 1.0165 1.0022 1.0065 1.0019 1.0028 1.0001 1.0035 1.0167 1.0130 0.9963 0.9968 1.0065 0.9994 1.0143 0.9988 1.0049 1.0160 1.0052 1.0152 1.0101 1.0068 1.0096 1.0065
dispcorr: -0.023322457 hartree
energy: -1094.901635840909
dipole: -15.59841 17.04546 1.44705 -15.76612 14.17695 -1.58917 0.07686 -0.31628 -0.23943
magnitude: 2.16258 au
magnitude: 5.49683 debye
