program: Orca
programVersion: 5.0.2
elementType: O O O O N C C C C C C C C C C C C C C C C C C C H H H H H H H H H H H H H H H H H H H H H H H H H
charge: 0
multiplicity: 1
keywords: wb97x-d3
keywords: def2-TZVPP
keywords: def2/J RIJCOSX
keywords: DEFGRID2
keywords: scfconv7
keywords: smallprint printgap noloewdin
keywords: NOSOSCF
formula: C19H25NO4
InChI: InChI=1/C19H25NO4/c1-11(2)9-14-15(19(14,3)4)18(23)24-10-20-16(21)12-7-5-6-8-13(12)17(20)22/h9,14-15H,5-8,10H2,1-4H3
49 atoms
O  -0.594239 0.96689 0.67884
O  -1.890719 2.294416 1.915805
O  1.984976 2.175298 -1.105148
O  1.93129 -0.888128 2.259631
N  1.691609 0.864116 0.772718
C  -3.092192 1.100265 -1.217179
C  -2.821943 -0.259053 -0.660593
C  -2.920153 0.920838 0.281969
C  -2.023512 1.781791 -2.037223
C  -4.49135 1.442757 -1.670567
C  -3.860046 -1.322142 -0.631113
C  -1.779625 1.475454 1.042635
C  -3.980439 -2.248953 0.320453
C  0.551483 1.503708 1.326742
C  -5.050427 -3.295938 0.257008
C  -3.075206 -2.32635 1.511493
C  3.348226 0.218308 -0.688955
C  3.329233 -0.680245 0.295242
C  4.287566 0.204768 -1.838288
C  4.231896 -1.853699 0.397655
C  5.434808 -0.765638 -1.549283
C  4.932747 -2.07701 -0.944008
C  2.286131 1.228012 -0.433819
C  2.257876 -0.312948 1.259892
H  -1.809297 -0.616031 -0.828068
H  -3.841695 1.003508 0.847412
H  -1.01268 1.504226 -1.74754
H  -2.144844 1.517928 -3.089733
H  -2.104341 2.867677 -1.960625
H  -5.257239 0.971959 -1.054196
H  -4.652304 2.521241 -1.631197
H  -4.651782 1.122512 -2.702497
H  -4.551423 -1.351988 -1.468557
H  0.517367 1.308852 2.398474
H  0.61771 2.578948 1.159333
H  -4.618811 -4.299553 0.229716
H  -5.689987 -3.256834 1.142503
H  -5.685595 -3.179271 -0.620286
H  -3.639907 -2.192202 2.437606
H  -2.607536 -3.311675 1.575922
H  -2.28103 -1.583333 1.493835
H  3.747302 -0.091148 -2.743559
H  4.662211 1.211772 -2.034904
H  4.96358 -1.677946 1.192989
H  3.67045 -2.739302 0.703569
H  5.991194 -0.963233 -2.466754
H  6.137317 -0.294367 -0.855715
H  5.762549 -2.773515 -0.815957
H  4.234303 -2.551677 -1.639528
totalener: -1094.85311010 hartree
nucrepener: 2104.69549910 hartree
electener: -3199.54860920 hartree
oneelecener: -5670.99504797 hartree
twoeener: 2471.44643877 hartree
kineticenergy: 1090.09100332 hartree
xcener: -105.969201880489 hartree
chargesum: 0.0000000
charge: -0.269137 -0.357706 -0.319396 -0.317924 -0.118311 0.125843 0.013559 -0.105456 -0.243946 -0.282016 -0.261168 0.321839 -0.002190 0.070734 -0.211574 -0.220754 -0.080040 -0.088679 -0.076800 -0.072952 -0.133847 -0.136289 0.251252 0.261367 0.096096 0.088658 0.083096 0.082242 0.093507 0.085146 0.094597 0.088843 0.093066 0.126721 0.127735 0.085901 0.085425 0.077868 0.088682 0.087727 0.078561 0.093594 0.095104 0.092734 0.095247 0.080603 0.075851 0.080497 0.076092
qa: -0.2691 -0.3577 -0.3194 -0.3179 -0.1183 0.1258 0.0136 -0.1055 -0.2439 -0.2820 -0.2612 0.3218 -0.0022 0.0707 -0.2116 -0.2208 -0.0800 -0.0887 -0.0768 -0.0730 -0.1338 -0.1363 0.2513 0.2614 0.0961 0.0887 0.0831 0.0822 0.0935 0.0851 0.0946 0.0888 0.0931 0.1267 0.1277 0.0859 0.0854 0.0779 0.0887 0.0877 0.0786 0.0936 0.0951 0.0927 0.0952 0.0806 0.0759 0.0805 0.0761
va: 2.0667 2.1465 2.1889 2.1935 3.1138 3.7319 3.7861 3.8418 3.9082 3.9167 3.9103 4.2069 3.7266 3.9122 3.9431 3.9404 3.6269 3.6401 3.9280 3.9251 3.8973 3.8993 4.2684 4.2652 1.0224 1.0292 1.0163 1.0033 1.0037 1.0048 1.0059 1.0005 1.0093 1.0068 1.0019 0.9987 0.9992 1.0098 1.0015 1.0020 1.0236 1.0085 1.0185 1.0082 1.0192 1.0119 1.0089 1.0117 1.0087
dispcorr: -0.023730417 hartree
energy: -1094.876840520737
dipole: -13.54551 14.62755 1.08204 -13.83252 12.64010 -1.19242 -11.53580 10.44256 -1.09323
magnitude: 1.94624 au
magnitude: 4.94694 debye
