program: Orca
programVersion: 5.0.2
elementType: O O O O N C C C C C C C C C C C C C C C C C C C H H H H H H H H H H H H H H H H H H H H H H H H H
charge: 0
multiplicity: 1
keywords: wb97x-d3
keywords: def2-TZVPP
keywords: def2/J RIJCOSX
keywords: DEFGRID2
keywords: scfconv7
keywords: smallprint printgap noloewdin
keywords: NOSOSCF
formula: C19H25NO4
InChI: InChI=1/C19H25NO4/c1-11(2)9-14-15(19(14,3)4)18(23)24-10-20-16(21)12-7-5-6-8-13(12)17(20)22/h9,14-15H,5-8,10H2,1-4H3
49 atoms
O  0.179312 0.6709 -0.026538
O  1.776485 2.121405 0.540295
O  -2.41236 0.230181 2.157952
O  -2.345925 1.396774 -2.23211
N  -2.082202 1.069896 0.035857
C  3.554424 0.061682 -1.064229
C  3.773736 -0.110247 0.408065
C  2.360966 -0.104557 -0.13517
C  3.860793 1.399107 -1.690952
C  3.831077 -1.099945 -1.986335
C  4.307505 -1.365784 0.981658
C  1.455875 1.015508 0.166739
C  5.455455 -1.499005 1.652684
C  -0.809297 1.671284 0.219932
C  5.883701 -2.832848 2.185911
C  6.411186 -0.379054 1.926898
C  -3.976055 -0.200405 0.359375
C  -3.957621 0.144856 -0.929064
C  -5.04556 -0.99098 1.014969
C  -4.99384 -0.217863 -1.925402
C  -6.273814 -1.035198 0.104515
C  -5.8959 -1.311277 -1.35002
C  -2.765577 0.351874 1.01185
C  -2.733486 0.939992 -1.186268
H  4.058272 0.802174 0.922382
H  1.869973 -1.069412 -0.200217
H  4.88061 1.391028 -2.079883
H  3.789298 2.228738 -0.991396
H  3.192587 1.603059 -2.529714
H  3.541777 -2.05853 -1.557444
H  4.895919 -1.149124 -2.222681
H  3.289407 -0.979735 -2.92617
H  3.703483 -2.255754 0.830068
H  -0.697394 2.501983 -0.476033
H  -0.733974 2.049138 1.238754
H  6.050537 -2.788738 3.265127
H  6.831404 -3.145858 1.740576
H  5.146081 -3.610689 1.990467
H  6.104051 0.573444 1.500974
H  7.398437 -0.616951 1.523869
H  6.546016 -0.238949 3.00182
H  -4.67529 -2.001103 1.216507
H  -5.294148 -0.560787 1.987604
H  -5.576845 0.674124 -2.175758
H  -4.527778 -0.544356 -2.857817
H  -6.965497 -1.798503 0.462433
H  -6.800736 -0.079066 0.167343
H  -6.795272 -1.399268 -1.960474
H  -5.378882 -2.27274 -1.411997
elementType: O N C H
totalener: -1094.87131315 hartree
nucrepener: 2026.23437715 hartree
electener: -3121.10569030 hartree
oneelecener: -5514.54874787 hartree
twoeener: 2393.44305757 hartree
cpcmener: -0.03724665 hartree
kineticenergy: 1090.04193565 hartree
xcener: -105.973066625815 hartree
chargesum: -0.0000000
charge: -0.278650 -0.497426 -0.433815 -0.433310 -0.116463 0.131914 0.031658 -0.118517 -0.286176 -0.262765 -0.287028 0.422888 -0.034772 0.088769 -0.224269 -0.253436 -0.067439 -0.069644 -0.074341 -0.069812 -0.134989 -0.136164 0.341343 0.337284 0.093254 0.091411 0.096974 0.092004 0.101977 0.090104 0.096777 0.098481 0.123457 0.135869 0.130839 0.093798 0.094649 0.089492 0.089793 0.095643 0.097733 0.103089 0.094008 0.101685 0.094683 0.080966 0.078581 0.080995 0.078899
qa: -0.2787 -0.4974 -0.4338 -0.4333 -0.1165 0.1319 0.0317 -0.1185 -0.2862 -0.2628 -0.2870 0.4229 -0.0348 0.0888 -0.2243 -0.2534 -0.0674 -0.0696 -0.0743 -0.0698 -0.1350 -0.1362 0.3413 0.3373 0.0933 0.0914 0.0970 0.0920 0.1020 0.0901 0.0968 0.0985 0.1235 0.1359 0.1308 0.0938 0.0946 0.0895 0.0898 0.0956 0.0977 0.1031 0.0940 0.1017 0.0947 0.0810 0.0786 0.0810 0.0789
va: 2.1139 2.0024 2.0778 2.0777 3.1406 3.6778 3.7586 3.9121 3.9044 3.9062 3.8754 4.1117 3.7245 3.8823 3.9222 3.9444 3.6803 3.6895 3.9192 3.9181 3.9155 3.9177 4.1871 4.1887 1.0300 1.0365 1.0007 1.0176 0.9986 1.0038 1.0029 1.0025 1.0076 1.0018 1.0025 0.9959 0.9961 1.0082 1.0084 0.9973 0.9970 1.0044 1.0149 1.0042 1.0151 1.0095 1.0068 1.0094 1.0065
dispcorr: -0.021663047 hartree
energy: -1094.892976198553
dipole: 22.08236 -23.38055 -1.29819 -14.04759 12.44097 -1.60662 -1.66395 1.06150 -0.60245
magnitude: 2.15162 au
magnitude: 5.46897 debye
