program: Orca
programVersion: 5.0.2
elementType: O O O O N C C C C C C C C C C C C C C C C C C C H H H H H H H H H H H H H H H H H H H H H H H H H
charge: 0
multiplicity: 1
keywords: wb97x-d3
keywords: def2-TZVPP
keywords: def2/J RIJCOSX
keywords: DEFGRID2
keywords: scfconv7
keywords: smallprint printgap noloewdin
keywords: NOSOSCF
formula: C19H25NO4
InChI: InChI=1/C19H25NO4/c1-11(2)9-14-15(19(14,3)4)18(23)24-10-20-16(21)12-7-5-6-8-13(12)17(20)22/h9,14-15H,5-8,10H2,1-4H3
49 atoms
O  0.177571 1.063752 0.33218
O  1.724363 1.31212 1.927164
O  -2.78979 2.583439 -0.693554
O  -1.870642 -1.106617 1.788926
N  -2.075891 0.953925 0.776571
C  3.684635 1.087791 -0.516001
C  3.632618 -0.230494 0.192266
C  2.338263 0.443796 -0.220474
C  4.146697 2.299996 0.25395
C  4.083414 1.126953 -1.971063
C  4.013438 -1.497508 -0.467681
C  1.426833 0.979832 0.802302
C  4.956714 -2.350406 -0.056063
C  -0.848278 1.521121 1.212541
C  5.242339 -3.606113 -0.823032
C  5.812809 -2.15144 1.156497
C  -3.94229 0.464272 -0.481992
C  -3.669135 -0.62257 0.24195
C  -5.091874 0.603043 -1.408343
C  -4.451509 -1.881404 0.224508
C  -6.090926 -0.52687 -1.151433
C  -5.39626 -1.876463 -0.978145
C  -2.910123 1.49091 -0.198735
C  -2.452978 -0.358514 1.044389
H  3.847481 -0.167554 1.254136
H  1.840023 0.022587 -1.086689
H  3.649493 3.204829 -0.100897
H  5.219211 2.434883 0.102056
H  3.980854 2.220112 1.325595
H  5.17106 1.110258 -2.065229
H  3.724696 2.044437 -2.440747
H  3.687601 0.287589 -2.541359
H  3.46962 -1.744806 -1.375107
H  -0.913224 2.607583 1.172138
H  -0.656644 1.217127 2.239639
H  6.284264 -3.635463 -1.152214
H  4.607365 -3.704796 -1.703076
H  5.092616 -4.48976 -0.197128
H  5.739733 -3.011046 1.827395
H  5.566683 -1.258793 1.728492
H  6.864668 -2.07651 0.86795
H  -5.565635 1.579271 -1.283103
H  -4.728752 0.573385 -2.440485
H  -3.781282 -2.743483 0.19352
H  -5.013129 -1.969092 1.159831
H  -6.666298 -0.29894 -0.249858
H  -6.804547 -0.575421 -1.97452
H  -4.827595 -2.109576 -1.882536
H  -6.138023 -2.667259 -0.86196
elementType: O N C H
totalener: -1094.87055586 hartree
nucrepener: 2037.55455560 hartree
electener: -3132.42511146 hartree
oneelecener: -5537.27680461 hartree
twoeener: 2404.85169315 hartree
cpcmener: -0.03749014 hartree
kineticenergy: 1090.04142065 hartree
xcener: -105.973212512369 hartree
chargesum: -0.0000000
charge: -0.279923 -0.495312 -0.433454 -0.435265 -0.117080 0.125444 0.035149 -0.125009 -0.284462 -0.264517 -0.282874 0.430627 -0.042896 0.090771 -0.221463 -0.252209 -0.080337 -0.053941 -0.073247 -0.071450 -0.134683 -0.134683 0.344417 0.333899 0.094378 0.090872 0.101230 0.096339 0.092268 0.096928 0.098785 0.089928 0.123181 0.138133 0.128157 0.093360 0.089452 0.094758 0.095598 0.089639 0.097686 0.094005 0.102971 0.093712 0.101873 0.078592 0.081217 0.078534 0.080902
qa: -0.2799 -0.4953 -0.4335 -0.4353 -0.1171 0.1254 0.0351 -0.1250 -0.2845 -0.2645 -0.2829 0.4306 -0.0429 0.0908 -0.2215 -0.2522 -0.0803 -0.0539 -0.0732 -0.0715 -0.1347 -0.1347 0.3444 0.3339 0.0944 0.0909 0.1012 0.0963 0.0923 0.0969 0.0988 0.0899 0.1232 0.1381 0.1282 0.0934 0.0895 0.0948 0.0956 0.0896 0.0977 0.0940 0.1030 0.0937 0.1019 0.0786 0.0812 0.0785 0.0809
va: 2.1118 2.0052 2.0764 2.0728 3.1401 3.6752 3.7642 3.8925 3.9035 3.9087 3.8679 4.1151 3.7428 3.8689 3.9208 3.9432 3.7052 3.6757 3.9207 3.9176 3.9150 3.9167 4.1918 4.1907 1.0301 1.0369 0.9986 1.0003 1.0187 1.0025 1.0023 1.0045 1.0084 1.0023 1.0125 0.9962 1.0085 0.9961 0.9973 1.0092 0.9969 1.0150 1.0048 1.0154 1.0044 1.0067 1.0094 1.0068 1.0094
dispcorr: -0.021661396 hartree
energy: -1094.892217254263
dipole: 21.81715 -22.99120 -1.17406 -12.32349 11.28634 -1.03715 -10.06598 8.56516 -1.50082
magnitude: 2.16946 au
magnitude: 5.51432 debye
