program: Orca
programVersion: 5.0.2
elementType: O O O O N C C C C C C C C C C C C C C C C C C C H H H H H H H H H H H H H H H H H H H H H H H H H
charge: 0
multiplicity: 1
keywords: wb97x-d3
keywords: def2-TZVPP
keywords: def2/J RIJCOSX
keywords: DEFGRID2
keywords: scfconv7
keywords: smallprint printgap noloewdin
keywords: NOSOSCF
formula: C19H25NO4
InChI: InChI=1/C19H25NO4/c1-11(2)9-14-15(19(14,3)4)18(23)24-10-20-16(21)12-7-5-6-8-13(12)17(20)22/h9,14-15H,5-8,10H2,1-4H3
49 atoms
O  0.448469 1.7949 -1.114204
O  0.588792 1.357813 1.074303
O  -1.779224 0.121966 -2.499412
O  -2.425839 2.183508 1.500336
N  -1.829139 1.419754 -0.597917
C  3.624556 0.923826 0.445894
C  2.957427 -0.415638 0.387572
C  2.376623 0.742403 -0.400868
C  3.578973 1.695273 1.741716
C  4.905765 1.137412 -0.322822
C  3.53315 -1.556891 -0.36004
C  1.072153 1.313352 -0.030027
C  3.972925 -2.702982 0.168029
C  -0.836152 2.378825 -0.961789
C  4.522988 -3.790461 -0.704877
C  3.974706 -3.012212 1.633276
C  -3.167528 -0.454157 -0.599142
C  -3.355009 0.154713 0.57224
C  -3.822224 -1.717354 -1.017963
C  -4.272349 -0.309973 1.64065
C  -4.446857 -2.392594 0.204264
C  -5.196855 -1.396207 1.087084
C  -2.194337 0.339643 -1.389684
C  -2.50526 1.371024 0.616745
H  2.398768 -0.670011 1.283458
H  2.558758 0.71405 -1.469685
H  2.724214 1.442661 2.364945
H  3.558743 2.772352 1.562242
H  4.478787 1.478128 2.321433
H  4.902062 0.650517 -1.297635
H  5.757236 0.746429 0.238968
H  5.080204 2.2025 -0.487921
H  3.6009 -1.43808 -1.437868
H  -1.062156 2.80696 -1.935752
H  -0.832188 3.177041 -0.219377
H  3.956369 -4.71752 -0.581536
H  5.55717 -4.02466 -0.438375
H  4.500846 -3.523059 -1.761473
H  4.993832 -3.203447 1.980201
H  3.405459 -3.922214 1.840533
H  3.564771 -2.214331 2.25012
H  -4.584144 -1.499758 -1.773541
H  -3.098628 -2.377772 -1.502095
H  -3.68278 -0.690614 2.481091
H  -4.849425 0.52907 2.037286
H  -5.121531 -3.185573 -0.121462
H  -3.658118 -2.873674 0.789997
H  -5.681289 -1.918577 1.913423
H  -5.994784 -0.927849 0.50361
elementType: O N C H
totalener: -1094.87932613 hartree
nucrepener: 2098.13051312 hartree
electener: -3193.00983925 hartree
oneelecener: -5658.92764096 hartree
twoeener: 2465.91780170 hartree
cpcmener: -0.03272762 hartree
kineticenergy: 1090.04516670 hartree
xcener: -105.971849719716 hartree
chargesum: 0.0000000
charge: -0.282829 -0.462566 -0.410043 -0.402934 -0.102948 0.144977 0.018026 -0.144443 -0.290608 -0.260637 -0.272468 0.416294 -0.036749 0.089605 -0.222792 -0.252646 -0.082851 -0.066545 -0.075853 -0.073470 -0.134174 -0.137008 0.313590 0.318380 0.099232 0.087296 0.094847 0.099232 0.093904 0.088395 0.095866 0.097220 0.118977 0.143264 0.130903 0.093573 0.092716 0.088482 0.096057 0.095621 0.089837 0.100289 0.093314 0.101503 0.093837 0.080011 0.078213 0.080542 0.077561
qa: -0.2828 -0.4626 -0.4100 -0.4029 -0.1029 0.1450 0.0180 -0.1444 -0.2906 -0.2606 -0.2725 0.4163 -0.0367 0.0896 -0.2228 -0.2526 -0.0829 -0.0665 -0.0759 -0.0735 -0.1342 -0.1370 0.3136 0.3184 0.0992 0.0873 0.0948 0.0992 0.0939 0.0884 0.0959 0.0972 0.1190 0.1433 0.1309 0.0936 0.0927 0.0885 0.0961 0.0956 0.0898 0.1003 0.0933 0.1015 0.0938 0.0800 0.0782 0.0805 0.0776
va: 2.1155 2.0493 2.1076 2.1139 3.0765 3.6634 3.7755 3.8937 3.9020 3.9079 3.8750 4.1535 3.7293 3.8859 3.9238 3.9442 3.6873 3.6527 3.9217 3.9188 3.9133 3.9156 4.2181 4.2156 1.0247 1.0410 1.0200 0.9994 1.0005 1.0040 1.0031 1.0028 1.0088 0.9928 1.0170 0.9959 0.9965 1.0086 0.9973 0.9977 1.0088 1.0046 1.0156 1.0049 1.0157 1.0095 1.0069 1.0093 1.0065
dispcorr: -0.022794288 hartree
energy: -1094.902120420910
dipole: 20.80859 -21.05319 -0.24460 -18.87470 17.64028 -1.23441 6.84681 -7.04566 -0.19885
magnitude: 1.27403 au
magnitude: 3.23832 debye
