program: Orca
programVersion: 5.0.2
elementType: O O O O N C C C C C C C C C C C C C C C C C C C H H H H H H H H H H H H H H H H H H H H H H H H H
charge: 0
multiplicity: 1
keywords: wb97x-d3
keywords: def2-TZVPP
keywords: def2/J RIJCOSX
keywords: DEFGRID2
keywords: scfconv7
keywords: smallprint printgap noloewdin
keywords: NOSOSCF
formula: C19H25NO4
InChI: InChI=1/C19H25NO4/c1-11(2)9-14-15(19(14,3)4)18(23)24-10-20-16(21)12-7-5-6-8-13(12)17(20)22/h9,14-15H,5-8,10H2,1-4H3
49 atoms
O  0.618772 1.064318 -1.121179
O  1.730587 2.983915 -0.824109
O  -2.288984 -0.508892 -2.292152
O  -1.495868 2.381315 1.119513
N  -1.671342 1.161216 -0.825911
C  2.553857 0.127468 1.132719
C  2.82481 -0.536856 -0.186062
C  2.747114 0.974359 -0.115029
C  1.1847 -0.032412 1.749444
C  3.652037 0.217158 2.16435
C  4.122496 -1.168783 -0.502124
C  1.665684 1.783736 -0.708996
C  4.311897 -2.396802 -0.99633
C  -0.574136 1.725415 -1.533969
C  5.695635 -2.903746 -1.275625
C  3.219722 -3.371045 -1.316087
C  -3.297752 -0.29942 -0.10197
C  -3.062333 0.544143 0.904354
C  -4.288698 -1.402675 -0.075667
C  -3.758286 0.52587 2.21414
C  -4.726936 -1.65822 1.367432
C  -5.004391 -0.356312 2.118033
C  -2.397099 0.045815 -1.229659
C  -2.000668 1.491642 0.484535
H  1.954782 -1.015519 -0.620425
H  3.695502 1.500416 -0.147189
H  0.882612 0.870028 2.284554
H  1.207723 -0.847931 2.475495
H  0.411304 -0.275489 1.023711
H  3.725807 -0.717058 2.725524
H  3.440255 1.014703 2.879314
H  4.630178 0.419765 1.729917
H  5.004366 -0.563538 -0.311484
H  -0.710761 1.559969 -2.600937
H  -0.52498 2.795553 -1.344157
H  6.461909 -2.165083 -1.039471
H  5.808683 -3.180643 -2.327544
H  5.908692 -3.806212 -0.696071
H  2.222044 -3.01841 -1.060412
H  3.38145 -4.312485 -0.783811
H  3.221036 -3.618411 -2.381462
H  -5.146892 -1.130421 -0.698803
H  -3.867056 -2.305625 -0.523543
H  -3.072349 0.148221 2.979706
H  -4.020339 1.541097 2.521387
H  -5.615919 -2.290581 1.372709
H  -3.942907 -2.216447 1.887312
H  -5.376551 -0.573008 3.120378
H  -5.796094 0.195835 1.603383
elementType: O N C H
totalener: -1094.87835100 hartree
nucrepener: 2119.55123810 hartree
electener: -3214.42958910 hartree
oneelecener: -5700.73825641 hartree
twoeener: 2486.30866731 hartree
cpcmener: -0.03261131 hartree
kineticenergy: 1090.03063540 hartree
xcener: -105.969747159366 hartree
chargesum: -0.0000000
charge: -0.272498 -0.454010 -0.407926 -0.402450 -0.085741 0.111602 0.077838 -0.127975 -0.280488 -0.270997 -0.297568 0.407034 -0.044000 0.071567 -0.220425 -0.252338 -0.085486 -0.010568 -0.069885 -0.070417 -0.137225 -0.134410 0.327150 0.239542 0.098507 0.090091 0.103401 0.098593 0.078358 0.095715 0.098620 0.087224 0.117152 0.127369 0.134975 0.087675 0.092570 0.092838 0.088357 0.094047 0.097109 0.099927 0.092814 0.101045 0.094831 0.080996 0.078254 0.081190 0.078014
qa: -0.2725 -0.4540 -0.4079 -0.4025 -0.0857 0.1116 0.0778 -0.1280 -0.2805 -0.2710 -0.2976 0.4070 -0.0440 0.0716 -0.2204 -0.2523 -0.0855 -0.0106 -0.0699 -0.0704 -0.1372 -0.1344 0.3272 0.2395 0.0985 0.0901 0.1034 0.0986 0.0784 0.0957 0.0986 0.0872 0.1172 0.1274 0.1350 0.0877 0.0926 0.0928 0.0884 0.0940 0.0971 0.0999 0.0928 0.1010 0.0948 0.0810 0.0783 0.0812 0.0780
va: 2.1005 2.0548 2.1085 2.1035 3.0963 3.6896 3.7180 3.8502 3.9126 3.9106 3.8632 4.1852 3.7631 3.8710 3.9237 3.9433 3.7088 3.5989 3.9189 3.9182 3.9166 3.9144 4.2003 4.2272 1.0233 1.0337 1.0043 1.0023 1.0125 1.0021 1.0012 1.0067 1.0115 1.0075 1.0221 1.0090 0.9961 0.9965 1.0106 0.9976 0.9965 1.0049 1.0162 1.0053 1.0155 1.0094 1.0070 1.0096 1.0067
dispcorr: -0.024225254 hartree
energy: -1094.902576258208
dipole: 12.84760 -14.19991 -1.35231 -21.13818 19.04662 -2.09157 11.27990 -10.17411 1.10579
magnitude: 2.72510 au
magnitude: 6.92664 debye
