program: Orca
programVersion: 5.0.2
elementType: O O O O N C C C C C C C C C C C C C C C C C C C H H H H H H H H H H H H H H H H H H H H H H H H H
charge: 0
multiplicity: 1
keywords: wb97x-d3
keywords: def2-TZVPP
keywords: def2/J RIJCOSX
keywords: DEFGRID2
keywords: scfconv7
keywords: smallprint printgap noloewdin
keywords: NOSOSCF
formula: C19H25NO4
InChI: InChI=1/C19H25NO4/c1-11(2)9-14-15(19(14,3)4)18(23)24-10-20-16(21)12-7-5-6-8-13(12)17(20)22/h9,14-15H,5-8,10H2,1-4H3
49 atoms
O  0.258631 1.193611 -0.56692
O  1.556836 2.076616 1.030302
O  -1.74001 0.08976 1.744786
O  -2.853517 1.752203 -2.332113
N  -2.025455 1.203772 -0.248845
C  3.793128 0.652004 -0.692104
C  3.526816 -0.11483 0.56722
C  2.366239 0.274758 -0.322436
C  4.262982 2.081514 -0.580688
C  4.37497 -0.070248 -1.882593
C  3.862783 -1.548752 0.716301
C  1.38943 1.275045 0.143472
C  4.731316 -2.06056 1.593561
C  -0.851981 2.006912 -0.202651
C  4.965778 -3.538818 1.673594
C  5.532266 -1.243643 2.561096
C  -3.587205 -0.410223 0.2598
C  -3.916689 0.085661 -0.933843
C  -4.329163 -1.473139 0.980039
C  -5.100613 -0.323033 -1.728405
C  -5.325456 -2.137801 0.027039
C  -6.060057 -1.114426 -0.837694
C  -2.359179 0.275386 0.729239
C  -2.911691 1.110621 -1.315342
H  3.609729 0.480851 1.470536
H  1.941729 -0.519094 -0.92767
H  5.354641 2.108861 -0.588875
H  3.934608 2.572281 0.333003
H  3.915298 2.677248 -1.42752
H  5.460501 -0.146174 -1.787628
H  4.161657 0.474226 -2.804573
H  3.983923 -1.080625 -1.999779
H  3.344339 -2.237093 0.054702
H  -0.948197 2.822998 -0.917163
H  -0.729711 2.423392 0.795451
H  6.008885 -3.785018 1.45714
H  4.337904 -4.095181 0.977512
H  4.76413 -3.914442 2.680698
H  6.59143 -1.505427 2.495475
H  5.228335 -1.450955 3.590997
H  5.450613 -0.170142 2.400107
H  -3.634436 -2.208005 1.394263
H  -4.84633 -1.033431 1.839195
H  -5.59562 0.554084 -2.15213
H  -4.774374 -0.926101 -2.582163
H  -4.791343 -2.840866 -0.61874
H  -6.042613 -2.725773 0.601693
H  -6.604624 -0.419504 -0.191753
H  -6.806246 -1.613896 -1.457296
elementType: O N C H
totalener: -1094.87993075 hartree
nucrepener: 2042.79259523 hartree
electener: -3137.67252598 hartree
oneelecener: -5547.81519581 hartree
twoeener: 2410.14266983 hartree
cpcmener: -0.03099864 hartree
kineticenergy: 1090.03779317 hartree
xcener: -105.969770007044 hartree
chargesum: -0.0000000
charge: -0.278901 -0.462226 -0.409646 -0.408994 -0.103189 0.134669 0.031315 -0.147302 -0.285813 -0.259181 -0.282707 0.416807 -0.027012 0.082619 -0.224727 -0.256527 -0.059401 -0.081707 -0.071033 -0.075010 -0.135710 -0.135514 0.313350 0.323381 0.093016 0.091507 0.095037 0.093716 0.099435 0.096047 0.097784 0.087960 0.117993 0.128456 0.136338 0.093731 0.088149 0.093438 0.092856 0.099187 0.090078 0.094190 0.100652 0.093041 0.101819 0.078498 0.080599 0.077696 0.081236
qa: -0.2789 -0.4622 -0.4096 -0.4090 -0.1032 0.1347 0.0313 -0.1473 -0.2858 -0.2592 -0.2827 0.4168 -0.0270 0.0826 -0.2247 -0.2565 -0.0594 -0.0817 -0.0710 -0.0750 -0.1357 -0.1355 0.3134 0.3234 0.0930 0.0915 0.0950 0.0937 0.0994 0.0960 0.0978 0.0880 0.1180 0.1285 0.1363 0.0937 0.0881 0.0934 0.0929 0.0992 0.0901 0.0942 0.1007 0.0930 0.1018 0.0785 0.0806 0.0777 0.0812
va: 2.1073 2.0490 2.1070 2.1088 3.1087 3.6834 3.7537 3.8828 3.9071 3.9055 3.8852 4.1643 3.7217 3.8527 3.9255 3.9460 3.6642 3.6909 3.9217 3.9199 3.9156 3.9134 4.2224 4.2246 1.0302 1.0381 1.0008 1.0179 0.9993 1.0030 1.0028 1.0045 1.0094 1.0088 1.0175 0.9965 1.0087 0.9951 0.9982 0.9964 1.0074 1.0151 1.0048 1.0157 1.0050 1.0064 1.0096 1.0070 1.0094
dispcorr: -0.021878828 hartree
energy: -1094.901809581758
dipole: 21.60090 -22.64109 -1.04019 -15.92091 14.39716 -1.52375 2.02484 -2.62809 -0.60325
magnitude: 1.94106 au
magnitude: 4.93378 debye
