program: Orca
programVersion: 5.0.2
elementType: O O O O N C C C C C C C C C C C C C C C C C C C H H H H H H H H H H H H H H H H H H H H H H H H H
charge: 0
multiplicity: 1
keywords: wb97x-d3
keywords: def2-TZVPP
keywords: def2/J RIJCOSX
keywords: DEFGRID2
keywords: scfconv7
keywords: smallprint printgap noloewdin
keywords: NOSOSCF
formula: C19H25NO4
InChI: InChI=1/C19H25NO4/c1-11(2)9-14-15(19(14,3)4)18(23)24-10-20-16(21)12-7-5-6-8-13(12)17(20)22/h9,14-15H,5-8,10H2,1-4H3
49 atoms
O  0.277638 1.268032 -0.797083
O  1.378241 2.072663 0.983967
O  -1.594956 0.219232 1.586004
O  -2.999171 1.615766 -2.502167
N  -2.013781 1.185582 -0.46006
C  3.809012 0.683945 -0.460481
C  3.343794 -0.154628 0.688902
C  2.336228 0.319056 -0.332035
C  4.286029 2.087854 -0.185816
C  4.543816 0.015949 -1.596518
C  3.645517 -1.604883 0.792869
C  1.316926 1.310058 0.051982
C  4.652333 -2.120854 1.502834
C  -0.879229 2.046152 -0.519471
C  4.874737 -3.600369 1.58145
C  5.628549 -1.288445 2.275969
C  -3.512697 -0.414368 0.24547
C  -3.928751 0.006441 -0.949694
C  -4.19366 -1.437474 1.075717
C  -5.142803 -0.478166 -1.650466
C  -5.61296 -1.657943 0.549452
C  -5.65178 -1.753879 -0.975538
C  -2.272162 0.320116 0.595285
C  -2.973309 1.026944 -1.452414
H  3.301499 0.379411 1.63413
H  1.991785 -0.422034 -1.04533
H  4.093325 2.745251 -1.036337
H  5.365433 2.079344 -0.019696
H  3.82813 2.534026 0.694356
H  5.602625 -0.097844 -1.35404
H  4.476411 0.617414 -2.505226
H  4.151006 -0.974404 -1.824805
H  2.990766 -2.284096 0.254157
H  -1.020574 2.758923 -1.329735
H  -0.775588 2.592133 0.416056
H  4.846308 -3.947278 2.617993
H  5.860673 -3.870301 1.19353
H  4.127177 -4.160767 1.019858
H  5.497005 -0.217686 2.126839
H  6.654531 -1.538022 1.993183
H  5.548955 -1.489046 3.348052
H  -3.618284 -2.368413 1.042228
H  -4.208066 -1.131203 2.124349
H  -5.907181 0.305555 -1.626168
H  -4.929153 -0.654582 -2.707308
H  -6.028061 -2.565839 0.989455
H  -6.25044 -0.832314 0.878492
H  -6.670124 -1.959082 -1.30885
H  -5.040748 -2.600716 -1.30052
elementType: O N C H
totalener: -1094.87897366 hartree
nucrepener: 2051.36400080 hartree
electener: -3146.24297446 hartree
oneelecener: -5565.08870697 hartree
twoeener: 2418.84573252 hartree
cpcmener: -0.03107377 hartree
kineticenergy: 1090.03644922 hartree
xcener: -105.969699739130 hartree
chargesum: -0.0000000
charge: -0.285091 -0.457994 -0.409992 -0.409885 -0.094682 0.136434 -0.013102 -0.134424 -0.294193 -0.266612 -0.250945 0.421208 -0.037680 0.077677 -0.228036 -0.249974 -0.059381 -0.084739 -0.073763 -0.070258 -0.133957 -0.136315 0.317215 0.320487 0.100226 0.093160 0.100807 0.095153 0.094593 0.095852 0.099614 0.091250 0.119710 0.124246 0.140911 0.093834 0.093883 0.088944 0.086646 0.094132 0.101381 0.101146 0.092338 0.100483 0.093161 0.079912 0.078040 0.080416 0.078164
qa: -0.2851 -0.4580 -0.4100 -0.4099 -0.0947 0.1364 -0.0131 -0.1344 -0.2942 -0.2666 -0.2509 0.4212 -0.0377 0.0777 -0.2280 -0.2500 -0.0594 -0.0847 -0.0738 -0.0703 -0.1340 -0.1363 0.3172 0.3205 0.1002 0.0932 0.1008 0.0952 0.0946 0.0959 0.0996 0.0912 0.1197 0.1242 0.1409 0.0938 0.0939 0.0889 0.0866 0.0941 0.1014 0.1011 0.0923 0.1005 0.0932 0.0799 0.0780 0.0804 0.0782
va: 2.1066 2.0553 2.1082 2.1091 3.0943 3.6782 3.7911 3.8661 3.9005 3.9056 3.8640 4.1767 3.7049 3.8532 3.9281 3.9409 3.6584 3.6955 3.9229 3.9196 3.9142 3.9177 4.2236 4.2275 1.0246 1.0369 0.9999 1.0007 1.0181 1.0022 1.0029 1.0025 1.0075 1.0144 1.0175 0.9952 0.9964 1.0078 1.0079 0.9982 0.9981 1.0047 1.0158 1.0046 1.0157 1.0098 1.0066 1.0096 1.0064
dispcorr: -0.022479933 hartree
energy: -1094.901453591874
dipole: 22.34581 -23.19760 -0.85179 -16.08657 14.54144 -1.54513 3.92180 -4.40738 -0.48558
magnitude: 1.82996 au
magnitude: 4.65140 debye
