program: Orca
programVersion: 5.0.2
elementType: O O O O N C C C C C C C C C C C C C C C C C C C H H H H H H H H H H H H H H H H H H H H H H H H H
charge: 0
multiplicity: 1
keywords: wb97x-d3
keywords: def2-TZVPP
keywords: def2/J RIJCOSX
keywords: DEFGRID2
keywords: scfconv7
keywords: smallprint printgap noloewdin
keywords: NOSOSCF
formula: C19H25NO4
InChI: InChI=1/C19H25NO4/c1-11(2)9-14-15(19(14,3)4)18(23)24-10-20-16(21)12-7-5-6-8-13(12)17(20)22/h9,14-15H,5-8,10H2,1-4H3
49 atoms
O  0.434765 1.714937 -1.208302
O  0.479564 1.315448 0.993071
O  -2.526124 2.263554 1.295169
O  -1.831142 0.016485 -2.604133
N  -1.865569 1.382239 -0.742323
C  3.535011 0.859213 0.472612
C  2.827186 -0.458357 0.532893
C  2.305594 0.616743 -0.388583
C  3.478846 1.774692 1.670402
C  4.845493 0.93431 -0.272207
C  3.406118 -1.701277 -0.037204
C  1.000018 1.239394 -0.087048
C  4.20957 -2.531975 0.627888
C  -0.845588 2.309842 -1.108739
C  4.732189 -3.787779 0.00066
C  4.643676 -2.292627 2.041908
C  -3.430743 0.189003 0.45107
C  -3.239844 -0.462334 -0.695207
C  -4.375358 -0.221347 1.519443
C  -3.922901 -1.721655 -1.085117
C  -5.330062 -1.287106 0.977214
C  -4.596038 -2.337863 0.142834
C  -2.572515 1.404513 0.462903
C  -2.241107 0.282315 -1.508368
H  2.216973 -0.594126 1.422069
H  2.505485 0.489438 -1.447057
H  4.295204 1.530101 2.352487
H  2.547067 1.694117 2.223155
H  3.60442 2.816867 1.372146
H  5.668362 0.626606 0.376033
H  5.043432 1.95613 -0.600192
H  4.867702 0.289539 -1.14975
H  3.136855 -1.948092 -1.060065
H  -1.037025 2.706927 -2.103265
H  -0.858593 3.121258 -0.379767
H  4.425868 -4.668567 0.570518
H  5.824829 -3.792913 -0.015563
H  4.380146 -3.912928 -1.022492
H  4.255866 -3.071044 2.704275
H  4.31478 -1.330201 2.429323
H  5.732437 -2.331406 2.124719
H  -3.807974 -0.605444 2.373247
H  -4.922129 0.645879 1.896229
H  -4.660012 -1.507886 -1.865924
H  -3.209783 -2.41649 -1.534366
H  -5.857882 -1.765387 1.803623
H  -6.093584 -0.805629 0.359272
H  -5.288897 -3.120904 -0.168761
H  -3.836726 -2.823651 0.762437
totalener: -1094.85280295 hartree
nucrepener: 2098.48649399 hartree
electener: -3193.33929694 hartree
oneelecener: -5659.14812996 hartree
twoeener: 2465.80883302 hartree
kineticenergy: 1090.10303709 hartree
xcener: -105.972823789633 hartree
chargesum: -0.0000000
charge: -0.263327 -0.385111 -0.305873 -0.315285 -0.125912 0.094094 -0.036281 -0.118785 -0.269104 -0.241486 -0.187113 0.353114 -0.029321 0.092345 -0.211661 -0.235537 -0.071789 -0.101546 -0.077768 -0.077666 -0.136140 -0.134456 0.276404 0.243687 0.107615 0.082979 0.080610 0.108471 0.087281 0.086241 0.094486 0.082423 0.093872 0.123198 0.125980 0.085501 0.084264 0.079912 0.095885 0.081027 0.084282 0.095220 0.093313 0.091197 0.093008 0.078901 0.074360 0.078273 0.076216
qa: -0.2633 -0.3851 -0.3059 -0.3153 -0.1259 0.0941 -0.0363 -0.1188 -0.2691 -0.2415 -0.1871 0.3531 -0.0293 0.0923 -0.2117 -0.2355 -0.0718 -0.1015 -0.0778 -0.0777 -0.1361 -0.1345 0.2764 0.2437 0.1076 0.0830 0.0806 0.1085 0.0873 0.0862 0.0945 0.0824 0.0939 0.1232 0.1260 0.0855 0.0843 0.0799 0.0959 0.0810 0.0843 0.0952 0.0933 0.0912 0.0930 0.0789 0.0744 0.0783 0.0762
va: 2.1311 2.1113 2.2087 2.2017 3.0763 3.7053 3.8201 3.8817 3.9039 3.9090 3.8499 4.2294 3.7354 3.9100 3.9405 3.9404 3.6203 3.6450 3.9235 3.9292 3.8975 3.8986 4.2529 4.2848 1.0248 1.0357 1.0018 1.0211 1.0037 1.0034 1.0055 1.0071 1.0129 0.9940 1.0158 0.9977 0.9990 1.0106 1.0013 1.0115 1.0007 1.0076 1.0203 1.0080 1.0191 1.0115 1.0084 1.0114 1.0084
dispcorr: -0.023454210 hartree
energy: -1094.876257154915
dipole: 22.07334 -22.20253 -0.12919 -17.49500 16.57399 -0.92101 9.17231 -9.11663 0.05568
magnitude: 0.93169 au
magnitude: 2.36818 debye
