program: Orca
programVersion: 5.0.2
elementType: O O O O N C C C C C C C C C C C C C C C C C C C H H H H H H H H H H H H H H H H H H H H H H H H H
charge: 0
multiplicity: 1
keywords: wb97x-d3
keywords: def2-TZVPP
keywords: def2/J RIJCOSX
keywords: DEFGRID2
keywords: scfconv7
keywords: smallprint printgap noloewdin
keywords: NOSOSCF
formula: C19H25NO4
InChI: InChI=1/C19H25NO4/c1-11(2)9-14-15(19(14,3)4)18(23)24-10-20-16(21)12-7-5-6-8-13(12)17(20)22/h9,14-15H,5-8,10H2,1-4H3
49 atoms
O  0.482662 1.310864 -0.436205
O  1.716366 3.082356 -0.995931
O  -2.512235 0.852114 -2.304909
O  -1.608461 1.190872 2.142179
N  -1.793689 1.306827 -0.156486
C  3.219137 0.387742 0.763235
C  2.747204 -0.457738 -0.383705
C  2.824237 1.03581 -0.553321
C  2.344064 0.525854 1.985658
C  4.692947 0.417788 1.086875
C  3.667547 -1.326245 -1.164602
C  1.646824 1.921795 -0.6901
C  4.133131 -2.506473 -0.753922
C  -0.675684 2.134691 -0.441859
C  5.041816 -3.332536 -1.612058
C  3.78806 -3.108508 0.574117
C  -3.561224 -0.152705 -0.369306
C  -3.297997 -0.051337 0.933248
C  -4.637074 -0.987846 -0.959799
C  -4.046858 -0.741768 2.012511
C  -5.154784 -1.971291 0.091784
C  -5.35641 -1.299749 1.450574
C  -2.598001 0.697734 -1.119621
C  -2.143663 0.868572 1.117939
H  1.739551 -0.847207 -0.267922
H  3.663153 1.41507 -1.127707
H  1.281566 0.434792 1.7741
H  2.504175 1.489014 2.4740
H  2.600691 -0.250432 2.709687
H  4.954035 1.347663 1.595022
H  5.317557 0.331489 0.199057
H  4.955411 -0.409015 1.75028
H  3.961541 -0.967877 -2.147139
H  -0.818987 2.598762 -1.417406
H  -0.590997 2.913447 0.316746
H  5.987591 -3.532258 -1.10203
H  5.267436 -2.84422 -2.559302
H  4.59676 -4.305978 -1.833532
H  4.692392 -3.341283 1.141451
H  3.254947 -4.053663 0.442639
H  3.166427 -2.457362 1.185641
H  -5.444085 -0.339506 -1.316011
H  -4.268475 -1.512473 -1.843948
H  -3.427262 -1.544308 2.425642
H  -4.233491 -0.056847 2.842536
H  -6.090122 -2.417656 -0.248695
H  -4.439743 -2.792321 0.197915
H  -5.789065 -2.00826 2.158521
H  -6.078935 -0.48503 1.347126
totalener: -1094.85307899 hartree
nucrepener: 2089.58063178 hartree
electener: -3184.43371077 hartree
oneelecener: -5640.73017186 hartree
twoeener: 2456.29646109 hartree
kineticenergy: 1090.09388903 hartree
xcener: -105.970026778456 hartree
chargesum: 0.0000000
charge: -0.267803 -0.360393 -0.313713 -0.322021 -0.117508 0.065457 0.012992 -0.086719 -0.255874 -0.251199 -0.217612 0.322525 -0.017444 0.074689 -0.209974 -0.246727 -0.093501 -0.076594 -0.073563 -0.077114 -0.136944 -0.134098 0.261487 0.249727 0.100767 0.085256 0.090362 0.096863 0.078286 0.100369 0.083761 0.081998 0.092123 0.126449 0.126830 0.084157 0.080573 0.085519 0.087988 0.097483 0.082257 0.093051 0.095653 0.093689 0.094986 0.080595 0.076532 0.080470 0.075910
qa: -0.2678 -0.3604 -0.3137 -0.3220 -0.1175 0.0655 0.0130 -0.0867 -0.2559 -0.2512 -0.2176 0.3225 -0.0174 0.0747 -0.2100 -0.2467 -0.0935 -0.0766 -0.0736 -0.0771 -0.1369 -0.1341 0.2615 0.2497 0.1008 0.0853 0.0904 0.0969 0.0783 0.1004 0.0838 0.0820 0.0921 0.1264 0.1268 0.0842 0.0806 0.0855 0.0880 0.0975 0.0823 0.0931 0.0957 0.0937 0.0950 0.0806 0.0765 0.0805 0.0759
va: 2.0858 2.1428 2.2002 2.1867 3.1123 3.7231 3.7850 3.8727 3.9170 3.9122 3.8672 4.2653 3.7348 3.9057 3.9388 3.9376 3.6381 3.6278 3.9251 3.9275 3.8994 3.8966 4.2704 4.2686 1.0216 1.0305 1.0155 1.0039 1.0041 1.0055 1.0071 1.0016 1.0139 1.0076 0.9999 0.9990 1.0106 0.9980 0.9995 1.0032 1.0101 1.0082 1.0190 1.0084 1.0186 1.0118 1.0085 1.0119 1.0087
dispcorr: -0.023895140 hartree
energy: -1094.876974128350
dipole: 16.20870 -17.16749 -0.95879 -22.21457 20.50218 -1.71238 7.80162 -7.09821 0.70341
magnitude: 2.08478 au
magnitude: 5.29910 debye
